program: Gaussian 09
title: 000148962
version: EM64L-G09RevD.01
frameworkgroup: C1[X(C14H24N6O4)]
method: RPBEPBE
basis: SDD
operation: Freq
keyword: #p
keyword: freq=noraman
keyword: PBEPBE/SDD
title: #p freq=noraman PBEPBE/SDD
converged: YES YES NO NO
title: Mulliken charges:
elementType: O O O O N N N N N N C C C C C C C C C C C C C C H H H H H H H H H H H H H H H H H H H H H H H H
charge: -0.272511 -0.299632 -0.466604 -0.259962 -0.392533 -0.357234 -0.600204 -0.570438 -0.383293 -0.250634 -0.204627 -0.379781 -0.343980 -0.362930 -0.206893 0.205387 0.268611 -0.548022 -0.397707 0.416593 -0.441408 -0.399679 -0.158245 0.219661 0.245632 0.205562 0.227679 0.196903 0.199756 0.219847 0.184517 0.333152 0.210424 0.249716 0.237723 0.209229 0.179108 0.324520 0.283630 0.285363 0.271441 0.244731 0.273038 0.258813 0.353667 0.301125 0.273571 0.416921
chargesum: 0.00000
title: Mulliken charges with hydrogens summed into heavy atoms:
elementType: O O O O N N N N N N C C C C C C C C C C C C C C
charge: -0.272511 -0.299632 -0.049683 -0.259962 -0.059381 -0.032714 -0.031211 -0.038586 -0.029626 -0.250634 0.041004 0.053460 0.052679 0.041434 0.003530 0.205387 0.268611 -0.060584 -0.009370 0.416593 0.074764 -0.098555 0.115325 0.219661
polarizability: 2.18110474e+02 1.27200725e+01 2.01821591e+02 4.89725146e+00 -2.04239587e-01 1.80567989e+02
1716.lowfreq: -0.0008 0.0003 0.0004 3.1275 4.4832 8.9668 19.4436 24.2840 30.7659
frequency: 19.2660 23.8419 30.7528 33.8222 42.8235 51.2832 59.5596 65.2144 80.5446 96.2532 102.9983 121.2564 122.7039 135.5942 145.0372 151.1137 163.3207 197.7754 206.9241 233.7203 244.9662 248.2706 264.7453 281.1414 293.4864 330.2252 332.8738 350.0315 369.0676 389.9142 408.6246 446.2334 470.9612 496.0909 543.4162 582.1602 601.5960 623.4712 632.1433 651.8018 655.4621 665.1529 680.1896 696.1057 718.2308 726.5285 736.5927 737.9446 760.0758 788.7364 793.1979 834.0833 843.8726 862.8950 882.9006 907.2457 930.3960 937.4044 953.7051 968.6888 991.4682 997.7630 1005.3360 1028.5533 1041.0902 1061.7735 1087.4145 1091.9401 1093.6222 1109.7710 1116.4896 1119.6211 1146.2400 1149.4389 1159.2458 1191.9511 1197.9537 1199.4890 1209.6319 1222.4601 1236.2080 1245.1019 1249.7064 1253.6928 1272.3522 1278.4009 1285.3889 1293.0262 1299.4194 1313.9394 1316.2729 1320.2015 1343.4811 1355.3559 1360.4605 1384.9079 1388.7710 1400.0195 1446.7163 1454.9719 1457.1049 1462.3844 1467.1854 1474.6235 1481.7070 1486.1270 1491.9470 1516.6485 1578.8860 1602.0549 1617.8218 1627.2275 1638.5427 1641.0621 1928.7323 2857.7822 2861.3118 2957.5384 2971.0056 2980.8866 3006.8625 3008.9632 3013.3540 3023.7995 3036.5471 3039.9784 3056.8738 3074.2063 3134.4741 3242.3262 3257.9873 3451.7667 3476.7122 3490.3840 3530.9179 3565.8890 3579.3719 3607.9180
redmass: 6.5638 1.8412 4.7571 5.4688 6.6077 5.6308 3.8440 4.4526 5.9667 5.1399 3.4786 4.3546 2.2785 4.6013 1.6539 2.2055 3.0339 4.0562 5.2592 1.8673 3.2763 2.8628 3.5485 5.9770 4.7753 2.2329 4.6975 3.9846 3.4875 5.0508 2.9966 3.7642 2.8075 1.4731 2.9356 4.4485 1.2978 2.0208 1.9011 1.3952 3.4300 2.8024 1.2137 4.4349 4.7059 3.0219 1.6135 2.5328 4.3680 1.2238 1.4852 3.4048 1.6631 4.4809 1.5980 3.0943 4.6047 1.9930 2.4527 2.3968 2.3525 2.9843 2.4716 2.6707 3.4739 2.8836 2.8763 2.2671 2.5692 3.2215 2.2831 1.4548 1.4794 1.4665 1.3645 1.4826 1.5875 1.4029 1.6505 1.5986 2.0213 1.5188 1.7081 2.1312 1.3672 1.3812 1.0534 1.1621 1.4164 1.3712 1.3655 1.4078 1.3844 2.3198 1.5884 1.6578 1.4624 2.7699 1.0963 2.1836 1.2874 1.0775 1.1934 1.1703 1.7173 1.7990 1.0909 1.4539 4.0762 6.8288 5.0841 3.8558 1.0943 1.1208 1.1318 1.0824 1.0716 1.0639 1.0600 1.0608 1.0868 1.0603 1.0949 1.0884 1.0634 1.0988 1.1023 1.1021 1.1015 1.0994 1.1009 1.0448 1.0448 1.0772 1.0772 1.0825 1.0975 1.0992
irintensity: 0.6939 1.6873 1.3336 0.2280 2.8593 1.3191 2.1506 6.2481 17.6643 6.5359 5.2492 13.6676 4.3996 5.2450 16.3417 22.6429 0.8869 8.2076 2.4646 25.7245 40.4595 24.8569 33.9267 11.8066 24.0075 0.8805 23.8974 29.1459 5.2730 3.2822 41.9616 4.1744 62.0318 176.7943 4.5728 10.0780 208.3002 53.1070 94.9098 211.1555 79.8577 16.1098 70.0286 16.8793 16.9344 5.4691 9.7044 28.9446 5.7806 1.2536 19.4224 7.4086 26.0344 2.3301 0.4806 9.5164 2.7817 1.7342 7.6934 6.3702 4.7247 8.6163 3.6115 3.4073 5.3083 5.7063 62.1448 230.8360 17.8270 10.4133 32.2258 334.6484 20.9041 35.4077 137.5781 183.4366 9.1660 7.6865 26.6278 25.2608 25.8441 28.6286 33.0075 48.3356 30.8043 5.9369 0.8905 15.4516 25.4762 24.9019 14.4149 18.1159 4.6599 5.2134 0.8640 7.0434 16.7924 15.8209 22.1607 10.0596 59.1637 1.5593 6.6647 60.0227 164.8222 109.2664 4.3482 32.5816 32.8964 201.9927 66.1780 328.3809 36.0963 56.0700 1871.1005 69.4788 115.0942 16.2013 14.2378 48.7343 24.8785 23.4767 5.6505 7.3480 27.1014 15.2634 96.1937 8.0084 0.3134 3.2271 1.6531 1.7210 1.6977 40.9357 27.6066 80.6106 0.1874 2.7993
temp: 298.150 k
press: 1.00000 atm
elementType: 8 8 8 8 7 7 7 7 7 7 6 6 6 6 6 6 6 6 6 6 6 6 6 6 1 1 1 1 1 1 1 1 1 1 1 1 1 1 1 1 1 1 1 1 1 1 1 1
symmnumber: 1
zpe: 1029643.8 jmol-1
zpe.correction: 0.392171 hartree
zpe.thermalcorrener: 0.418180 hartree
zpe.thermalcorrenthalpy: 0.419125 hartree
zpe.thermalcorrgfe: 0.332821 hartree
zpe.sumelectzpe: -1175.465749 hartree
zpe.sumelectthermal: -1175.439739 hartree
zpe.sumelectthermalent: -1175.438794 hartree
zpe.sumelectthermalfe: -1175.525098 hartree
dipole: 3.2248 5.2447 -1.0471
dipole: 6.2452
quadrupole: -159.3192 -140.1346 -134.9388
quadrupole: -4.1426 13.1462 13.3274
quadrupole: -14.5217 4.6630 9.8587 -4.1426 13.1462 13.3274
hfenergy: -1175.8579191 hartree
pointgroup: C01 [X(C14H24N6O4)]
dipole: 0.9003193 2.1524254 -0.7704479 debye
polarizability: 213.5578386|15.225088|205.9774661|2.1167193|-3.6129715|180.96475 unknown
InChI: InChI=1S/C14H24N6O4/c15-4-2-1-3-11(14(24)18-7-12(21)22)20-13(23)10(16)5-9-6-17-8-19-9/h6,8,10-11,18-21H,1-5,7,15-16H2
charge 0 multiplicity 1
48 atoms
O  0.757438 -2.086037 2.128603
O  0.457372 1.708584 -1.126565
O  -2.985801 -2.45381 -0.638682
O  -3.299045 -2.299906 1.665059
N  0.822487 0.44061 0.797833
N  -0.292062 -2.673195 0.123851
N  0.358602 3.695506 1.352054
N  7.445639 0.891461 -0.823978
N  -2.326758 1.625979 -1.753961
N  -3.585088 -0.05438 -0.990094
C  1.340051 -0.786969 0.144739
C  2.87355 -0.9477 0.275192
C  3.66477 0.178051 -0.423424
C  5.191995 -0.009047 -0.292009
C  -0.463012 2.517896 1.037957
C  0.59139 -1.930654 0.876839
C  0.326912 1.53789 0.128015
C  -1.758017 2.989973 0.299037
C  5.993448 1.11985 -0.971836
C  -2.495684 1.869082 -0.380665
C  -1.340797 -3.510872 0.745564
C  -3.295734 0.81762 0.076105
C  -2.980966 0.463571 -2.084583
C  -2.665071 -2.721237 0.664167
H  1.061198 -0.717937 -0.923533
H  3.152885 -1.927582 -0.162769
H  3.130847 -0.999253 1.350909
H  3.385619 0.217017 -1.495998
H  3.36866 1.156623 0.004895
H  5.50533 -0.973006 -0.737499
H  5.466019 -0.054475 0.784106
H  0.668435 0.349653 1.808437
H  -0.788116 1.943818 1.941722
H  -1.438435 3.742651 -0.443546
H  -2.412088 3.497739 1.031442
H  5.757616 1.125765 -2.053824
H  5.642833 2.101172 -0.563661
H  -0.45687 -2.41512 -0.853006
H  -0.128181 4.437148 1.862452
H  1.293669 3.501367 1.717402
H  -1.069283 -3.685229 1.796615
H  -1.429737 -4.470447 0.208296
H  8.033581 1.506723 -1.394512
H  7.760596 0.861204 0.151477
H  -1.629619 2.113285 -2.320484
H  -3.652725 0.602614 1.080008
H  -2.982448 0.019725 -3.075753
H  -3.518806 -1.50002 -0.778795
