program: Gaussian 09
title: 000148930
version: EM64L-G09RevD.01
frameworkgroup: C1[X(C20H16O3)]
method: RPBEPBE
basis: SDD
operation: Freq
keyword: #pfreq=noraman
keyword: PBEPBE/SDD
title: #p freq=noraman PBEPBE/SDD
converged: YES YES NO NO
title: Mulliken charges:
elementType: O O O C C C C C C C C C C C C C C C C C C C C H H H H H H H H H H H H H H H H
charge: -0.453865 -0.437795 -0.489998 0.123453 -0.214878 -0.284139 -0.142838 -0.542164 0.322158 0.275784 0.010690 0.505568 -0.702295 -0.006519 -0.454720 0.496958 0.478710 -0.500607 -0.512951 -0.485239 -0.471612 -0.466859 -0.245029 0.259900 0.225651 0.238849 0.212874 0.269612 0.259401 0.232053 0.244146 0.234519 0.350054 0.366472 0.357970 0.236999 0.242307 0.240963 0.226414
chargesum: 0.00000
title: Mulliken charges with hydrogens summed into heavy atoms:
elementType: O O O C C C C C C C C C C C C C C C C C C C C
charge: -0.103811 -0.071323 -0.132029 0.123453 0.045022 -0.058487 0.096011 -0.059677 0.322158 0.275784 0.010690 0.505568 -0.442894 -0.006519 -0.222666 0.496958 0.478710 -0.256461 -0.278432 -0.248240 -0.229305 -0.225896 -0.018615
polarizability: 3.75150767e+02 -1.25947686e+01 2.42445579e+02 -5.81711883e+00 2.67309142e+00 1.14720483e+02
1716.lowfreq: -10.0253 -0.0011 -0.0009 -0.0005 5.6602 9.6817 42.5908 51.3686 88.8222
frequency: 42.5706 51.3350 88.8160 136.4331 153.7316 165.9422 188.2905 217.9328 221.7509 246.4303 261.6142 273.5127 279.0787 294.7229 346.1478 351.2740 382.2708 392.2482 414.4083 434.8383 454.0369 476.9948 507.6296 510.0960 513.1122 527.5513 545.8734 552.0499 555.8051 599.1402 609.8041 619.7695 667.8203 692.7382 698.7995 738.5998 749.9863 768.9332 786.9485 810.1882 823.3095 836.1118 855.5481 866.7389 875.1173 886.1475 909.3155 919.9958 938.9140 967.4525 973.7868 983.1915 986.3854 989.8451 998.5319 1016.6583 1028.4234 1075.5629 1092.8074 1116.2344 1126.9858 1162.9678 1166.0531 1171.2500 1181.8140 1193.3274 1210.0616 1223.3535 1231.5340 1237.8642 1257.1096 1269.8442 1292.2333 1304.5430 1322.2813 1329.5146 1339.5385 1373.5084 1381.7486 1385.3496 1400.4081 1412.5898 1416.9283 1427.5623 1432.8393 1437.8142 1449.7373 1466.6045 1492.4754 1498.9057 1557.6579 1592.4537 1607.5135 1608.9798 1636.3754 2973.5387 2999.8079 3005.0528 3015.2961 3024.5446 3119.5426 3121.7683 3123.2930 3125.9655 3131.5218 3144.5441 3155.7115 3157.0096 3415.0233 3582.9628 3589.6395
redmass: 5.2633 5.3735 4.5229 4.8926 5.4372 5.6120 3.9384 4.0735 4.3170 5.3488 1.3843 2.5026 1.3130 3.0054 5.1377 4.4155 5.3676 3.1432 3.8896 4.5770 5.0455 5.8604 4.7264 5.7198 3.8585 4.7142 3.0687 5.3337 5.8174 5.3017 2.8093 1.3794 5.2104 4.4244 4.0598 2.8096 4.7236 1.2608 5.3514 4.3069 1.4526 2.8183 3.4432 2.5405 3.2397 3.4417 1.5680 1.7138 2.9216 4.6127 1.3855 1.4577 3.6088 1.4594 4.4909 3.4243 3.9371 1.9407 1.7589 2.5842 1.9201 1.1019 1.1123 1.3775 1.3918 1.2481 1.3847 1.3724 1.1580 1.6379 1.8095 1.8317 1.7049 1.9756 1.5201 2.8288 1.5252 1.6812 2.3402 2.8961 1.2369 2.3628 1.8844 4.9341 3.8301 2.2666 1.4633 4.0444 6.8545 3.6455 5.1388 7.4056 6.5713 6.7301 7.5024 1.0610 1.0842 1.0844 1.0889 1.0985 1.0863 1.0865 1.0871 1.0912 1.0917 1.0983 1.0972 1.0969 1.0652 1.0665 1.0664
irintensity: 0.3320 0.3728 0.7989 1.1650 1.6496 2.8319 3.5683 7.7358 4.5937 15.2644 26.1437 64.0058 283.5722 8.6989 3.6139 18.3102 0.4798 4.3974 1.0982 2.0459 2.2985 0.7339 3.6207 1.3461 2.7663 2.3335 0.9388 7.5004 1.1236 2.2893 47.2601 223.5024 0.9852 3.4097 2.9208 37.7437 8.3010 5.6761 2.6778 3.2785 0.2668 17.6595 9.2217 62.9607 6.5771 2.5506 31.3753 38.3064 26.2444 49.5558 0.9458 1.2666 109.7058 12.8836 3.4060 19.4403 30.0604 4.7743 2.9360 5.0746 11.4746 43.8645 24.6735 13.6264 4.2413 16.9542 10.3534 14.6195 21.6013 1.9447 4.7674 0.5437 10.5881 4.0738 4.5116 0.9824 14.2437 12.6477 3.3842 12.7081 71.0861 12.8976 7.2958 2.8308 0.9665 8.8793 7.7170 3.6904 6.1680 2.9437 0.2133 5.4817 3.0145 5.5284 0.1596 13.3580 23.0940 47.3100 114.9570 8.8156 0.9030 1.6824 3.0193 5.3307 16.4560 35.8471 40.0209 32.2108 78.8501 8.1162 9.5746
temp: 298.150 k
press: 1.00000 atm
elementType: 8 8 8 6 6 6 6 6 6 6 6 6 6 6 6 6 6 6 6 6 6 6 6 1 1 1 1 1 1 1 1 1 1 1 1 1 1 1 1
symmnumber: 1
zpe: 806009.4 jmol-1
zpe.correction: 0.306993 hartree
zpe.thermalcorrener: 0.324504 hartree
zpe.thermalcorrenthalpy: 0.325448 hartree
zpe.thermalcorrgfe: 0.262968 hartree
zpe.sumelectzpe: -995.844531 hartree
zpe.sumelectthermal: -995.827020 hartree
zpe.sumelectthermalent: -995.826075 hartree
zpe.sumelectthermalfe: -995.888555 hartree
dipole: 0.3233 -2.2127 0.3977
dipole: 2.2713
quadrupole: -122.4210 -120.3539 -135.1226
quadrupole: 6.8919 -5.2008 10.0048
quadrupole: 3.5448 5.6119 -9.1568 6.8919 -5.2008 10.0048
hfenergy: -996.1515237 hartree
pointgroup: C01 [X(C20H16O3)]
dipole: 0.1377886 -0.867261 0.1654084 debye
polarizability: 375.4727097|-10.9767829|242.1879511|-5.1375185|1.3051188|114.6561676 unknown
InChI: InChI=1S/C20H16O3/c21-16-9-14-13-7-6-11-3-1-2-10-4-5-12(18(13)17(10)11)8-15(14)19(22)20(16)23/h1-8,16,19-23H,9H2
charge 0 multiplicity 1
39 atoms
O  -4.260742 -0.5022 1.892412
O  -3.796296 1.722216 -1.109397
O  -3.948006 -0.950985 -1.729236
C  -1.4409 -0.625594 0.092687
C  -4.308244 -0.093987 0.478549
C  -3.370585 1.094852 0.159352
C  -3.869077 -1.345115 -0.298642
C  -2.450758 -1.767606 0.112213
C  -1.887882 0.722734 0.130627
C  -0.034854 -0.90102 0.063518
C  0.913085 0.188283 0.045035
C  0.438344 1.550281 0.064438
C  -0.955506 1.783395 0.115208
C  2.327611 -0.069841 0.008878
C  0.493771 -2.251787 0.064825
C  2.817585 -1.425951 -0.001343
C  3.266725 1.027085 -0.016969
C  1.399261 2.633139 0.038819
C  1.854494 -2.502448 0.033307
C  2.757897 2.382839 -0.001833
C  4.218903 -1.663087 -0.039719
C  4.659145 0.746546 -0.056086
C  5.128031 -0.585185 -0.067888
H  -5.335622 0.195268 0.179581
H  -3.53383 1.893798 0.908081
H  -4.580216 -2.171693 -0.106079
H  -2.121376 -2.598959 -0.542016
H  -2.519575 -2.180824 1.137999
H  -1.329622 2.814403 0.122012
H  -0.198696 -3.097954 0.106312
H  1.022429 3.662551 0.0505
H  2.225517 -3.5344 0.038221
H  -4.584638 0.245716 2.453187
H  -3.802689 0.979883 -1.779586
H  -3.515102 -1.642954 -2.286978
H  3.476875 3.210219 -0.023108
H  4.587324 -2.69557 -0.046453
H  5.371366 1.579824 -0.076805
H  6.205254 -0.781773 -0.098024
