program: Gaussian 09
title: 000148891
version: EM64L-G09RevD.01
frameworkgroup: C1[X(C16H11NO)]
method: RPBEPBE
basis: SDD
operation: Freq
keyword: #p
keyword: freq=noraman
keyword: PBEPBE/SDD
title: #p freq=noraman PBEPBE/SDD
converged: NO YES NO NO
title: Mulliken charges:
elementType: O N C C C C C C C C C C C C C C C C H H H H H H H H H H H
charge: -0.240044 -0.461979 -0.696404 0.319138 0.185444 0.275756 0.185951 -0.564840 -0.383297 -0.421016 -0.395392 0.518951 -0.480340 -0.236720 -0.234004 0.154220 0.038219 -0.379492 0.249826 0.249835 0.317642 0.241065 0.242350 0.236757 0.221918 0.225888 0.225563 0.322727 0.282276
chargesum: 0.00000
title: Mulliken charges with hydrogens summed into heavy atoms:
elementType: O N C C C C C C C C C C C C C C C C
charge: -0.240044 -0.139251 -0.196742 0.319138 0.185444 0.275756 0.185951 -0.247197 -0.142232 -0.178666 -0.158635 0.518951 -0.258423 -0.010832 -0.008441 0.154220 0.038219 -0.097216
polarizability: 3.90069777e+02 3.94498782e+00 1.72938920e+02 -2.54033924e-02 2.11850306e-04 7.18241283e+01
1716.lowfreq: -9.4742 -7.2285 -0.0009 0.0005 0.0009 2.0635 37.2624 52.7463 80.3725
frequency: 37.2567 52.7433 80.3724 99.8641 140.0799 155.2290 195.4170 209.7719 239.0131 290.6652 324.7330 346.6542 363.2468 422.4681 436.9382 465.4389 497.8972 508.3076 545.8172 590.3539 593.8632 621.5153 642.8625 655.4340 659.3317 667.4785 706.0709 712.4321 730.9077 742.6035 765.5991 777.8282 823.7254 826.0179 869.1138 908.2496 913.3950 941.6587 944.4705 945.8946 975.0779 985.9780 994.8785 1024.8488 1097.3049 1129.5332 1131.8923 1142.7575 1168.5053 1184.3961 1192.8630 1202.9206 1228.7640 1270.5824 1296.1978 1310.2316 1372.7900 1387.3270 1425.4177 1442.4937 1452.4128 1458.4672 1489.3889 1505.6910 1581.3823 1590.0523 1594.3881 1621.1667 1626.2904 2121.4691 2983.7506 3027.3668 3115.0363 3122.1521 3129.3343 3142.6673 3146.7500 3161.6249 3183.9702 3420.6387 3518.0352
redmass: 5.5864 6.9218 5.2219 4.9548 3.7947 5.4285 6.6892 4.7542 2.1264 5.5871 8.8477 5.6571 4.4831 2.6987 2.9115 6.9715 4.0963 3.2441 6.0240 8.6247 2.8941 7.1644 6.6092 1.2579 1.2493 1.3118 3.5255 4.3374 5.5052 1.6331 5.1733 2.1498 4.8635 1.5793 1.3696 1.5833 8.3826 3.4179 1.3817 1.4167 1.8090 1.3480 6.7926 2.1244 2.0837 2.0279 1.1526 1.6248 1.1475 1.7716 2.3418 1.8696 1.8164 1.9047 1.5528 2.3272 5.3623 4.5845 1.1706 3.0300 3.4619 2.6481 3.5827 2.3682 6.5449 6.6081 4.9106 7.2836 6.9029 6.0781 1.0611 1.0990 1.0882 1.0852 1.0895 1.0948 1.0960 1.1003 1.0935 1.1584 1.0769
irintensity: 0.9443 7.0507 2.4313 1.4793 0.0906 2.9461 1.9638 0.0007 10.6466 0.3609 9.8358 1.1028 0.8092 14.8882 0.0650 1.0522 1.2781 1.9041 0.0668 5.2055 8.9688 1.4733 5.2037 56.4926 57.0176 31.9356 13.3655 31.7548 2.4597 53.9687 0.9810 61.8011 0.9023 45.7432 0.0721 5.7416 22.5377 1.9024 4.5542 0.0048 23.9301 1.1427 4.9347 4.3471 4.5568 0.1588 0.0090 47.0684 0.0076 43.9435 70.2614 9.6630 10.9213 2.4138 19.6784 5.7211 54.6376 34.3983 18.6156 26.9098 142.2813 7.4395 145.9981 210.3764 219.6609 1.3953 19.3455 0.3430 3.7567 7.8558 10.0580 6.3776 20.2571 3.1795 2.6449 22.6188 23.7310 45.2797 4.6234 102.0302 18.5484
temp: 298.150 k
press: 1.00000 atm
elementType: 8 7 6 6 6 6 6 6 6 6 6 6 6 6 6 6 6 6 1 1 1 1 1 1 1 1 1 1 1
symmnumber: 1
zpe: 576645.0 jmol-1
zpe.correction: 0.219632 hartree
zpe.thermalcorrener: 0.234025 hartree
zpe.thermalcorrenthalpy: 0.234969 hartree
zpe.thermalcorrgfe: 0.177794 hartree
zpe.sumelectzpe: -745.029483 hartree
zpe.sumelectthermal: -745.015091 hartree
zpe.sumelectthermalent: -745.014147 hartree
zpe.sumelectthermalfe: -745.071322 hartree
dipole: 0.0598 3.1827 0.0029
dipole: 3.1833
quadrupole: -81.9112 -95.2745 -109.5379
quadrupole: 16.7092 0.0097 -0.0038
quadrupole: 13.6633 0.3000 -13.9634 16.7092 0.0097 -0.0038
hfenergy: -745.2491159 hartree
pointgroup: C01 [X(C16H11N1O1)]
dipole: 0.0124057 1.2523494 0.0011332 debye
polarizability: 389.9825968|5.8723859|173.0261002|-0.0254043|-0.0000137|71.8241283 unknown
InChI: InChI=1S/C16H11NO/c1-2-16(18)17-13-7-8-15-12(10-13)9-11-5-3-4-6-14(11)15/h1,3-8,10,17H,9H2
charge 0 multiplicity 1
29 atoms
O  3.710831 -1.686411 -0.000558
N  3.133166 0.605519 0.00127
C  -1.436931 -1.721328 0.000444
C  -0.427535 -0.57973 0.00059
C  -1.113819 0.672585 0.000382
C  -2.777195 -0.995118 0.000107
C  -2.565041 0.418809 0.00009
C  0.972948 -0.653383 0.000876
C  -0.375696 1.877692 0.000466
C  -4.080977 -1.520225 -0.000154
C  -3.662757 1.30881 -0.000194
C  1.710186 0.565525 0.00095
C  1.031049 1.818884 0.000749
C  -5.182303 -0.626544 -0.000438
C  -4.972605 0.775453 -0.000456
C  4.035348 -0.459034 0.001418
C  5.431738 -0.025333 -0.000725
C  6.637115 0.239648 -0.002381
H  -1.317695 -2.374525 0.887136
H  -1.317318 -2.374626 -0.886121
H  1.507845 -1.604868 0.001055
H  -0.880439 2.849598 0.000316
H  -4.250446 -2.603113 -0.000128
H  -3.508836 2.393806 -0.000205
H  1.614505 2.748611 0.000807
H  -6.204457 -1.021238 -0.000643
H  -5.835669 1.450751 -0.000674
H  3.55487 1.538394 0.001295
H  7.688617 0.466492 -0.002673
