program: Gaussian 09
title: 000148893
version: EM64L-G09RevD.01
frameworkgroup: C1[X(C16H16N2O)]
method: RPBEPBE
basis: SDD
operation: Freq
keyword: #p
keyword: freq=noraman
keyword: PBEPBE/SDD
title: #p freq=noraman PBEPBE/SDD
converged: NO YES NO NO
title: Mulliken charges:
elementType: O N N C C C C C C C C C C C C C C C C H H H H H H H H H H H H H H H H
charge: -0.318375 -0.514111 -0.165410 -0.697800 0.325278 0.183298 0.272284 0.186148 -0.563125 -0.390881 0.511860 -0.423543 -0.399926 -0.490675 -0.240740 -0.235092 0.299432 -0.632019 -0.670924 0.246462 0.246389 0.322486 0.236692 0.239751 0.234652 0.211320 0.222961 0.222369 0.323409 0.289829 0.223740 0.223870 0.235941 0.248632 0.235818
chargesum: 0.00000
title: Mulliken charges with hydrogens summed into heavy atoms:
elementType: O N N C C C C C C C C C C C C C C C C
charge: -0.318375 -0.190702 -0.165410 -0.204949 0.325278 0.183298 0.272284 0.186148 -0.240639 -0.154189 0.511860 -0.183792 -0.165275 -0.279356 -0.017779 -0.012723 0.299432 0.105420 0.049467
polarizability: 3.58548584e+02 -6.21038364e+00 1.87992357e+02 1.03722736e-01 -2.06348141e-01 8.75330934e+01
1716.lowfreq: -11.3977 -4.4524 -0.0005 0.0001 0.0008 1.7135 17.7035 36.3583 78.7111
frequency: 15.8088 36.3154 78.7006 83.4212 91.3077 125.7104 138.0581 167.5177 185.1932 201.4048 202.7261 238.5177 245.6484 334.1359 345.7631 375.3972 399.3540 421.8644 436.4160 466.5520 499.1187 506.6493 546.9001 561.1356 595.3977 597.5298 622.2463 645.1859 702.1142 708.5562 729.5009 741.3284 766.8564 775.6031 818.8557 822.3687 852.1312 867.9367 909.9972 937.8887 939.1658 943.9965 975.7113 982.9672 992.2058 1008.3085 1025.1038 1058.6434 1094.0817 1096.1677 1128.8741 1129.8686 1135.3311 1142.1993 1167.3221 1175.9063 1188.1186 1201.0861 1227.1118 1256.7889 1274.4251 1292.4760 1310.7835 1344.1508 1375.4035 1387.1386 1417.9721 1426.0257 1442.3532 1447.0309 1454.2799 1459.8129 1480.4651 1481.5077 1493.8684 1494.3632 1497.0484 1518.7827 1589.5527 1593.8152 1620.7381 1623.4189 1630.6917 2937.6050 2964.1810 2982.9478 3005.5077 3026.6969 3037.4342 3096.8528 3103.9320 3115.0508 3118.2890 3125.3870 3138.6961 3140.5048 3158.7166 3181.3204 3550.8761
redmass: 3.1781 4.2710 2.7735 4.6560 2.9650 1.7691 3.4583 1.2419 4.9676 2.5915 4.7605 2.1347 2.9959 4.2891 4.1948 5.9918 3.2123 2.6952 2.9207 4.7091 4.0483 2.8920 5.9434 1.3121 2.7852 5.4448 6.1208 6.2827 8.2710 3.1947 5.4060 1.6260 5.1555 2.1496 1.6022 4.8487 5.8377 1.3639 1.6071 1.3859 3.6554 1.3917 1.7486 1.3652 5.7683 2.5075 2.1180 1.4176 1.2331 2.0768 1.9747 1.1537 1.3291 1.5582 1.1506 1.8347 1.8642 1.9137 1.7580 5.0934 1.7155 1.6240 2.4043 3.1050 4.9141 4.4009 1.1535 1.1601 2.8048 1.2280 3.3506 2.8194 1.0675 1.1657 1.0535 2.4003 1.3250 1.9897 6.8345 6.3069 7.2703 4.1629 7.1895 1.0382 1.0365 1.0609 1.1018 1.0991 1.1024 1.0942 1.0881 1.0963 1.0851 1.0895 1.0950 1.0952 1.1003 1.0932 1.0752
irintensity: 2.4990 0.1513 7.2042 3.0468 2.5524 0.2976 0.0392 0.0099 0.1364 1.1756 1.7674 10.3723 3.7602 1.3511 1.5746 23.9443 1.4979 15.9675 0.0055 6.1520 0.0426 5.7916 0.4849 52.4199 0.0948 0.4709 1.6635 7.1407 19.4351 3.6342 0.4249 57.4504 0.2952 59.0316 36.7018 0.8142 5.5967 0.1836 4.8743 1.1674 5.5814 1.8357 23.8081 2.3275 2.0480 58.0304 1.9961 22.6368 0.0348 4.4276 0.9775 0.0143 0.3803 116.7486 2.2270 183.6873 31.1104 11.7359 31.6124 14.9512 50.7668 16.5029 58.4267 61.4508 149.4047 48.6733 34.2452 22.9856 21.9590 11.9646 256.5628 42.1451 36.6427 90.3698 12.3715 367.5807 67.3455 225.6422 5.4403 73.2020 5.1938 245.4607 82.7585 55.8372 122.2323 12.6626 40.3200 7.4342 45.4661 22.3051 29.0960 0.8586 4.1908 3.6741 5.4616 46.8078 45.5701 7.9638 14.4422
temp: 298.150 k
press: 1.00000 atm
elementType: 8 7 7 6 6 6 6 6 6 6 6 6 6 6 6 6 6 6 6 1 1 1 1 1 1 1 1 1 1 1 1 1 1 1 1
symmnumber: 1
zpe: 741721.6 jmol-1
zpe.correction: 0.282507 hartree
zpe.thermalcorrener: 0.299350 hartree
zpe.thermalcorrenthalpy: 0.300294 hartree
zpe.thermalcorrgfe: 0.236722 hartree
zpe.sumelectzpe: -802.720424 hartree
zpe.sumelectthermal: -802.703581 hartree
zpe.sumelectthermalent: -802.702637 hartree
zpe.sumelectthermalfe: -802.766209 hartree
dipole: -3.5474 3.1858 0.0319
dipole: 4.7681
quadrupole: -79.9942 -101.9721 -117.7268
quadrupole: -13.9781 -0.1182 -0.0676
quadrupole: 19.9035 -2.0744 -17.8291 -13.9781 -0.1182 -0.0676
hfenergy: -803.002931 hartree
pointgroup: C01 [X(C16H16N2O1)]
dipole: 1.3888958 1.2608801 -0.0123494 debye
polarizability: 358.4766347|7.1287231|188.0642939|0.1883656|0.1885836|87.5331059 unknown
InChI: InChI=1S/C16H16N2O/c1-18(2)16(19)17-13-7-8-15-12(10-13)9-11-5-3-4-6-14(11)15/h3-8,10,17H,9H2,1-2H3
charge 0 multiplicity 1
35 atoms
O  3.379801 -1.668089 0.01618
N  2.835743 0.62766 0.008083
N  5.09188 -0.06796 -0.003207
C  -1.726863 -1.727059 -0.00408
C  -0.723797 -0.578348 0.001078
C  -1.417761 0.669125 0.004071
C  -3.072282 -1.008244 -0.003851
C  -2.867842 0.407139 0.001133
C  0.677329 -0.648025 0.002934
C  -0.682507 1.875212 0.009035
C  1.414111 0.570224 0.007362
C  -4.372258 -1.542056 -0.007787
C  -3.972484 1.288737 0.002329
C  0.724791 1.819494 0.010461
C  -5.480616 -0.656427 -0.006631
C  -5.279149 0.746458 -0.001579
C  3.741285 -0.448844 0.008245
C  6.112714 -1.127525 0.009272
C  5.541204 1.33131 -0.02389
H  -1.605696 -2.381985 0.881064
H  -1.602961 -2.376415 -0.892937
H  1.219017 -1.595659 0.001788
H  -1.188212 2.847186 0.011642
H  -4.533799 -2.626499 -0.011713
H  -3.826237 2.375081 0.006178
H  1.303036 2.753418 0.014042
H  -6.500181 -1.058223 -0.009646
H  -6.146288 1.416965 -0.000708
H  3.221261 1.572302 0.012196
H  5.594228 -2.098191 0.026464
H  6.757545 -1.047929 0.905863
H  6.749824 -1.076685 -0.894891
H  5.181624 1.875021 -0.921856
H  6.642017 1.351077 -0.055223
H  5.231924 1.888653 0.88488
