program: Gaussian 09
title: 000148899
version: EM64L-G09RevD.01
frameworkgroup: C1[X(C9H16Cl2N6O4)]
method: RPBEPBE
basis: SDD
operation: Freq
keyword: #p
keyword: freq=noraman
keyword: PBEPBE/SDD
title: #p freq=noraman PBEPBE/SDD
converged: YES YES NO NO
title: Mulliken charges:
elementType: Cl Cl O O O O N N N N N N C C C C C C C C C H H H H H H H H H H H H H H H H
charge: -0.038487 -0.036582 -0.255239 -0.261560 -0.245422 -0.227955 -0.385180 -0.378994 -0.169160 -0.179448 0.033833 0.036232 -0.040578 -0.413779 -0.722600 0.356506 0.345913 -0.333799 -0.333795 -0.568030 -0.575379 0.261359 0.286060 0.232305 0.214398 0.248354 0.225146 0.337673 0.344416 0.272745 0.281191 0.268324 0.276791 0.284061 0.278818 0.302364 0.279495
chargesum: 0.00000
title: Mulliken charges with hydrogens summed into heavy atoms:
elementType: Cl Cl O O O O N N N N N N C C C C C C C C C
charge: -0.038487 -0.036582 -0.255239 -0.261560 -0.245422 -0.227955 -0.047506 -0.034578 -0.169160 -0.179448 0.033833 0.036232 0.220781 0.104587 -0.034702 0.356506 0.345913 0.220137 0.211321 -0.005151 0.006480
polarizability: 1.97699850e+02 -8.59306084e+00 2.08703270e+02 2.87395531e+01 4.21984651e-01 1.25913891e+02
1716.lowfreq: -1.7014 -0.0014 -0.0009 0.0015 2.6409 4.8296 14.4381 16.2830 24.8265
frequency: 14.3122 16.1174 24.8077 31.1275 34.6984 53.5034 55.9035 62.4017 71.8958 82.2585 112.8356 126.6211 133.1008 140.5795 178.0418 201.2865 216.7646 228.3354 234.2587 249.2140 253.0343 288.3256 315.1500 328.4264 330.0905 351.4665 400.7884 411.7740 419.1394 457.4801 473.6136 499.1624 508.9504 639.0173 666.3938 680.8886 693.2492 694.6425 708.3748 716.2397 724.5441 738.3524 779.4769 793.2645 818.4465 821.1735 845.6789 905.8077 921.9682 933.5600 963.6473 986.3238 1043.0018 1047.5820 1051.2325 1051.4859 1064.3005 1115.1024 1141.4549 1153.9822 1188.2433 1210.7145 1214.6272 1246.3979 1248.9018 1266.5545 1267.0922 1268.6669 1298.6478 1320.4461 1325.5834 1340.0453 1357.1594 1358.6386 1365.1594 1365.8391 1373.0896 1397.8347 1437.3308 1440.2856 1452.7728 1456.3289 1460.9856 1472.5492 1479.7379 1490.0986 1495.8918 1657.7742 1666.3827 2984.6925 3018.6275 3035.7643 3043.8769 3045.1903 3069.3557 3071.3606 3079.5076 3089.6929 3099.6112 3122.8081 3123.0748 3158.1166 3160.6867 3493.6424 3503.2262
redmass: 9.3834 11.0214 10.0703 6.0444 8.1964 6.9873 5.4526 3.7808 5.2911 2.7074 6.9239 4.8282 7.5611 7.2303 4.3760 8.3184 5.6517 5.1156 1.3372 4.0409 6.7918 4.7711 4.7706 3.0671 3.3988 3.2721 3.1505 5.3224 5.1034 12.0106 9.6368 6.6147 6.3586 2.3730 1.4017 1.5033 3.5847 5.0571 6.1406 4.9461 3.0537 2.1222 1.5008 1.9479 4.7468 3.5134 4.3566 2.1405 1.9193 2.5517 2.6244 2.7453 2.7114 1.6479 1.7210 3.9362 2.1790 2.5192 2.2809 2.5208 3.0150 1.7691 1.7946 2.3685 2.6059 1.2107 1.1916 1.1849 1.4339 1.1951 1.2400 1.4897 2.0946 1.3649 1.4871 1.7561 6.9185 1.2473 1.1101 1.0999 1.1018 1.0943 1.0925 1.2037 1.1497 1.3600 1.8793 8.9946 10.4214 1.0381 1.0622 1.0843 1.0604 1.0600 1.0558 1.0560 1.0975 1.1043 1.1001 1.1037 1.1040 1.1125 1.1128 1.0771 1.0775
irintensity: 0.0746 0.1059 0.2880 0.2598 0.0805 0.1556 1.7217 0.9458 0.6777 2.1421 7.4870 0.6544 3.2384 21.3795 2.6554 3.8683 6.0916 0.7790 3.5424 9.6160 2.8538 15.7870 16.4572 2.8420 19.9134 18.7690 2.2553 8.4168 2.1773 0.3635 0.9624 5.5360 13.1213 43.6090 161.9645 49.9217 22.9083 37.8362 20.8468 49.9124 13.1073 19.0865 44.6601 60.3005 48.6695 16.7816 24.0390 81.0513 30.8035 74.4768 77.9800 46.2994 22.5450 38.1050 41.0060 1.6869 16.2730 22.8761 5.3719 30.8719 39.4237 8.9025 14.5425 40.9891 19.9832 23.9963 19.3944 6.2925 3.8150 6.0122 27.5478 56.6585 93.3506 5.8609 19.4153 42.3345 175.0229 37.9570 23.8764 17.6871 20.4726 10.4337 8.3399 103.5358 54.1815 122.8701 478.2417 163.1972 264.1350 17.6428 22.8447 12.9860 0.9544 3.1044 13.4072 7.8691 36.6945 6.1424 22.7775 2.1623 0.5884 2.5351 0.7607 32.4846 54.4499
temp: 298.150 k
press: 1.00000 atm
elementType: 17 17 8 8 8 8 7 7 7 7 7 7 6 6 6 6 6 6 6 6 6 1 1 1 1 1 1 1 1 1 1 1 1 1 1 1 1
symmnumber: 1
zpe: 723906.2 jmol-1
zpe.correction: 0.275721 hartree
zpe.thermalcorrener: 0.299367 hartree
zpe.thermalcorrenthalpy: 0.300311 hartree
zpe.thermalcorrgfe: 0.216888 hartree
zpe.sumelectzpe: -1900.360739 hartree
zpe.sumelectthermal: -1900.337093 hartree
zpe.sumelectthermalent: -1900.336149 hartree
zpe.sumelectthermalfe: -1900.419572 hartree
dipole: 1.7330 -6.1036 1.3852
dipole: 6.4943
quadrupole: -162.3962 -136.3872 -138.5921
quadrupole: -6.1082 -10.4199 -5.8742
quadrupole: -16.6044 9.4046 7.1997 -6.1082 -10.4199 -5.8742
hfenergy: -1900.6364601 hartree
pointgroup: C01 [X(C9H16Cl2N6O4)]
dipole: -0.5966456 -2.3685387 -0.7498558 debye
polarizability: 194.1888686|5.9430256|208.5817774|32.7452709|6.4604618|129.5463658 unknown
InChI: InChI=1S/C9H16Cl2N6O4/c1-7(13-9(19)17(15-21)5-3-11)6-12-8(18)16(14-20)4-2-10/h7,12-13H,2-6H2,1H3
charge 0 multiplicity 1
37 atoms
Cl 5.751722 2.089887 0.894626
Cl -2.503078 4.361916 0.145768
O  2.56969 -1.742106 0.952583
O  -0.732793 -0.03265 1.437748
O  1.500853 2.202975 -1.164107
O  -4.785917 0.3315 -0.716439
N  0.962762 -1.654382 -0.754405
N  -1.749604 -1.882036 0.399768
N  2.179645 0.296327 -0.16666
N  -2.812239 0.243898 0.375946
N  1.303763 0.945439 -1.034415
N  -3.813512 -0.410484 -0.353936
C  0.359968 -2.970989 -0.470767
C  -0.670484 -2.836152 0.695701
C  -0.258413 -3.546839 -1.756905
C  1.923344 -1.123361 0.066122
C  -1.67182 -0.566832 0.787243
C  3.201697 1.014955 0.626365
C  -2.882769 1.67976 0.733062
C  4.502889 1.174936 -0.176987
C  -2.321724 2.566934 -0.393349
H  1.167432 -3.633402 -0.108574
H  -0.140763 -2.489666 1.599266
H  -1.115304 -3.824673 0.909324
H  -1.06611 -2.89718 -2.14492
H  0.50631 -3.649837 -2.545361
H  -0.688073 -4.545398 -1.563563
H  0.490937 -1.00927 -1.396234
H  -2.592612 -2.170907 -0.10569
H  2.791615 2.006041 0.885396
H  3.37958 0.425598 1.538401
H  -3.94349 1.926119 0.911253
H  -2.297696 1.819737 1.654348
H  4.367237 1.792579 -1.075905
H  4.962854 0.206026 -0.418236
H  -1.24759 2.409025 -0.564471
H  -2.897107 2.473614 -1.325194
