program: Gaussian 09
title: 000148916
version: EM64L-G09RevD.01
frameworkgroup: C1[X(C18H18O4)]
method: RPBEPBE
basis: SDD
operation: Freq
keyword: #pfreq=noraman
keyword: PBEPBE/SDD
title: #p freq=noraman PBEPBE/SDD
converged: YES YES NO NO
title: Mulliken charges:
elementType: O O O O C C C C C C C C C C C C C C C C C C H H H H H H H H H H H H H H H H H H
charge: -0.278391 -0.264296 -0.246560 -0.255459 -0.101103 -0.272598 -0.480386 0.208450 -0.527334 0.312470 0.165615 -0.412649 0.438469 -0.492048 -0.380436 -0.442310 -0.280463 0.303663 0.308807 -0.244386 -0.757808 -0.760075 0.278067 0.287863 0.251637 0.237635 0.238996 0.228064 0.233727 0.237490 0.270544 0.239842 0.230485 0.228909 0.248830 0.252815 0.244909 0.255289 0.247517 0.246211
chargesum: 0.00000
title: Mulliken charges with hydrogens summed into heavy atoms:
elementType: O O O O C C C C C C C C C C C C C C C C C C
charge: -0.278391 -0.264296 -0.246560 -0.255459 0.176963 0.015265 0.008886 0.208450 -0.060274 0.312470 0.165615 -0.178922 0.438469 -0.254558 -0.109892 -0.202469 -0.049978 0.303663 0.308807 -0.015477 -0.011254 -0.011058
polarizability: 2.51100058e+02 -2.65602956e+00 2.11152114e+02 -2.75344480e+01 2.66114519e+01 1.63211820e+02
1716.lowfreq: -0.0007 -0.0004 0.0000 2.1634 7.6180 11.9869 28.1155 36.4451 40.8993
frequency: 28.0449 36.4051 40.8889 43.9816 58.0639 61.3585 69.2409 73.4212 120.7615 128.3206 175.2110 182.8258 193.3860 219.3959 225.5232 267.2023 289.9596 315.8511 346.7374 387.0802 417.0095 435.0985 469.1589 483.2078 494.0965 509.3278 529.8050 551.2172 564.7419 570.1517 598.2387 606.6517 632.6685 656.9183 677.3189 690.8819 744.6647 761.4596 786.1249 825.8403 834.9058 844.8701 853.8678 863.5218 887.9898 899.0042 902.9990 933.0035 962.1274 976.9678 981.7547 989.9611 995.8780 997.8746 1004.2072 1035.6030 1041.7483 1042.8659 1045.5784 1090.7616 1134.3311 1157.8468 1173.0969 1175.8979 1190.7080 1193.9678 1202.9052 1209.1789 1235.7783 1240.7208 1275.4851 1280.4349 1299.9847 1321.9191 1338.1189 1360.7474 1368.3119 1382.6712 1384.9626 1391.1473 1408.5570 1426.3199 1433.3060 1450.9337 1451.9575 1453.6898 1454.5442 1455.9393 1461.8556 1472.9516 1520.1484 1583.8543 1607.1937 1634.3692 1642.3297 1649.2477 2974.7408 3004.9552 3006.2361 3007.2997 3032.6802 3046.7034 3052.2060 3076.0368 3097.2100 3099.4395 3114.4807 3120.5643 3133.8943 3140.2351 3140.5229 3142.9055 3150.6029 3164.3676
redmass: 5.7064 5.0453 1.3829 6.0467 1.0516 4.0203 2.5859 3.5546 3.6190 3.8127 5.1572 4.5167 6.0774 5.3971 4.2394 3.3867 3.8879 3.5180 3.2519 4.0268 3.5904 3.9794 3.6020 3.5674 4.8359 3.5769 5.2760 3.9131 3.2723 3.3021 4.9249 4.8397 4.5636 3.4301 4.0744 5.3066 2.9227 1.3554 3.4482 1.8268 3.8700 3.3653 2.4348 3.3857 2.0171 6.4732 3.4602 3.8961 1.3548 2.9663 1.5198 1.9393 1.4139 1.8837 2.3884 2.3273 1.6880 1.6702 2.1929 2.2008 1.5467 1.3158 1.2621 1.2248 2.2312 1.6950 3.1490 1.7250 1.6884 2.1298 1.4198 1.4850 1.4909 1.8373 1.5421 1.4251 1.9092 1.2437 1.2505 1.8934 3.4925 3.4208 3.3968 1.1459 1.0616 1.0615 1.0506 1.0563 1.0932 2.2760 3.5066 7.9324 5.7882 6.6343 9.3477 9.7180 1.0630 1.0648 1.0383 1.0372 1.0943 1.0838 1.0868 1.1009 1.0964 1.0942 1.0863 1.0867 1.0888 1.0975 1.1024 1.1014 1.0942 1.1002
irintensity: 0.1873 0.8556 1.9078 1.2588 0.2709 2.5831 3.1750 0.9885 1.4432 0.2152 3.2449 1.3183 5.7790 7.0324 1.1102 3.2392 4.4505 4.7227 1.9629 1.8429 1.3951 9.2074 19.9029 3.7732 13.0314 0.5374 4.2470 0.3512 6.3955 4.8377 7.4394 3.9812 6.4468 5.7182 4.4857 2.2218 7.9658 40.2535 4.5473 12.6036 23.5021 26.7310 26.5310 1.3704 22.2045 108.1546 25.8214 93.7709 3.8636 25.6947 2.9134 61.1649 9.5101 63.2013 7.1793 5.7264 13.8821 8.7654 31.6773 4.4817 4.6683 2.9008 24.5660 92.3511 256.5282 104.7197 320.5768 5.3011 0.9488 11.4151 7.7550 11.3937 1.6029 3.2413 2.0443 5.5766 1.6552 71.8122 36.3033 3.4964 1.7320 1.9413 1.7406 5.0757 24.6812 22.8148 20.2483 20.6107 16.4623 0.4464 20.8972 0.3626 6.8738 6.5572 169.5746 189.5699 21.9421 10.0629 1.9906 1.9005 26.5424 18.4395 3.8384 23.0867 6.7194 7.1495 5.7817 2.1969 9.0283 35.2624 9.3649 9.1861 17.9470 28.0746
temp: 298.150 k
press: 1.00000 atm
elementType: 8 8 8 8 6 6 6 6 6 6 6 6 6 6 6 6 6 6 6 6 6 6 1 1 1 1 1 1 1 1 1 1 1 1 1 1 1 1 1 1
symmnumber: 1
zpe: 833702.8 jmol-1
zpe.correction: 0.317541 hartree
zpe.thermalcorrener: 0.337873 hartree
zpe.thermalcorrenthalpy: 0.338817 hartree
zpe.thermalcorrgfe: 0.266263 hartree
zpe.sumelectzpe: -996.064468 hartree
zpe.sumelectthermal: -996.044136 hartree
zpe.sumelectthermalent: -996.043192 hartree
zpe.sumelectthermalfe: -996.115746 hartree
dipole: -1.5890 -1.7854 -1.2145
dipole: 2.6810
quadrupole: -129.6045 -117.9921 -123.1315
quadrupole: -5.6474 1.1887 -4.6530
quadrupole: -6.0285 5.5839 0.4445 -5.6474 1.1887 -4.6530
hfenergy: -996.3820087 hartree
pointgroup: C01 [X(C18H18O4)]
dipole: 0.7290408 -0.5275202 0.5502553 debye
polarizability: 250.5237806|12.243259|211.3568837|-15.9096561|-33.3306232|163.5833285 unknown
InChI: InChI=1S/C18H18O4/c1-11(19)21-16-10-9-14-8-7-13-5-3-4-6-15(13)17(14)18(16)22-12(2)20/h3-8,16,18H,9-10H2,1-2H3
charge 0 multiplicity 1
40 atoms
O  -2.291658 -1.226515 -0.832203
O  -0.782348 1.66457 0.921438
O  -4.608299 -1.121278 -0.563752
O  -1.092202 3.042166 -0.944391
C  -2.125979 -0.255394 0.299696
C  -0.775682 0.429969 0.036653
C  -2.146196 -0.987887 1.644501
C  0.444444 -0.389052 0.407472
C  -1.030257 -2.047055 1.702919
C  0.318199 -1.537703 1.209091
C  1.746432 0.026667 -0.073646
C  1.488708 -2.291908 1.552567
C  2.915321 -0.749163 0.289189
C  2.75137 -1.911895 1.1115
C  1.93955 1.182119 -0.905462
C  4.209868 -0.349236 -0.177781
C  3.213629 1.546814 -1.350443
C  -3.609535 -1.563483 -1.174365
C  -0.95814 2.906363 0.293463
C  4.362603 0.779681 -0.984345
C  -3.624031 -2.484371 -2.37441
C  -0.924326 4.01728 1.318865
H  -2.945777 0.481928 0.234739
H  -0.74909 0.774901 -1.011932
H  -3.137813 -1.442534 1.810715
H  -1.988781 -0.222887 2.429052
H  -1.321065 -2.91761 1.080473
H  -0.926266 -2.427403 2.736564
H  1.371175 -3.183936 2.179999
H  3.637369 -2.496284 1.387215
H  1.083303 1.792608 -1.207948
H  5.081221 -0.950388 0.1090
H  3.332897 2.429435 -1.988523
H  5.354569 1.07888 -1.339926
H  -2.756329 -3.162282 -2.361592
H  -3.564898 -1.87991 -3.298101
H  -4.563931 -3.055989 -2.393425
H  0.09915 4.113991 1.723456
H  -1.591939 3.785264 2.165054
H  -1.220568 4.966026 0.848823
