program: Gaussian 09
title: 000148889
version: EM64L-G09RevD.01
frameworkgroup: C1[X(C18H19NO)]
method: RPBEPBE
basis: SDD
operation: Freq
keyword: #p
keyword: freq=noraman
keyword: PBEPBE/SDD
title: #p freq=noraman PBEPBE/SDD
converged: YES YES NO NO
title: Mulliken charges:
elementType: O N C C C C C C C C C C C C C C C C C C H H H H H H H H H H H H H H H H H H H
charge: -0.256970 -0.470448 0.320594 -0.697552 0.185211 0.274250 0.185615 -0.569192 -0.386402 0.517144 -0.422660 -0.397370 -0.492701 -0.340299 -0.551314 -0.238572 -0.234941 0.206026 -0.341862 -0.691704 0.248113 0.248074 0.319809 0.239122 0.241049 0.235796 0.218863 0.237725 0.196950 0.233360 0.206746 0.303026 0.224498 0.224178 0.194117 0.190035 0.216049 0.210278 0.215360
chargesum: 0.00000
title: Mulliken charges with hydrogens summed into heavy atoms:
elementType: O N C C C C C C C C C C C C C C C C C C
charge: -0.256970 -0.167422 0.320594 -0.201365 0.185211 0.274250 0.185615 -0.249383 -0.147280 0.517144 -0.181611 -0.161574 -0.273837 0.094377 -0.111208 -0.014075 -0.010763 0.206026 0.042290 -0.050018
polarizability: 3.75081588e+02 -7.12413382e+00 1.98665123e+02 1.23464275e+01 5.28729374e+00 1.04983580e+02
1716.lowfreq: -11.5675 -2.4891 -0.0009 -0.0005 0.0010 3.5368 13.5573 32.7856 47.7005
frequency: 13.2179 32.7658 47.6614 55.6887 88.4366 104.1031 120.5761 136.6486 144.4233 183.0199 217.3980 230.0150 235.3850 237.9338 304.2867 345.0722 354.1175 384.9776 422.8590 436.9270 445.4323 500.5826 507.9862 545.4346 559.6044 595.7541 625.6767 639.5321 654.7540 702.0513 708.8626 732.0936 741.3949 742.4071 765.3676 777.7035 796.1539 823.3149 826.3114 868.2277 897.0827 910.0820 918.4852 933.8974 942.5328 943.6992 945.2610 976.0312 984.2530 994.3294 1024.9714 1029.4780 1076.5699 1086.7927 1097.7789 1107.6603 1130.0015 1132.6588 1146.5194 1168.0710 1183.6337 1190.7182 1202.6966 1215.3291 1227.6389 1258.2197 1274.3699 1281.9859 1289.6483 1296.4926 1310.8642 1331.9419 1352.4676 1373.4644 1387.4747 1390.5887 1425.0381 1442.7929 1443.8196 1452.1370 1459.2671 1469.4366 1476.1840 1476.9765 1488.1681 1490.3313 1508.4695 1590.4248 1593.8332 1619.8039 1621.3965 1628.9628 2961.8223 2967.3747 2974.6316 2984.0950 2984.4063 3007.3460 3020.7522 3028.6055 3057.6081 3072.4772 3074.3523 3109.2065 3119.7961 3126.9699 3140.4884 3144.2306 3159.7412 3181.6680 3528.0033
redmass: 4.2814 3.4402 5.7063 1.9668 3.3651 3.3510 2.7710 3.6633 3.9279 5.1152 1.2932 4.4636 2.7962 2.1215 4.0516 6.5838 4.3332 3.9645 2.7046 2.9203 3.8175 4.0267 3.2268 5.7696 4.0466 3.1118 4.5503 6.3815 1.1868 5.5502 2.9274 1.1355 4.3389 1.6848 3.5996 2.2121 1.3698 4.6846 1.5790 1.3686 1.8643 1.6105 1.4386 5.2965 2.5960 1.3948 1.4073 1.7636 1.3621 6.8371 2.1910 3.4267 2.4400 1.5032 2.0212 2.1597 1.9564 1.1513 1.5181 1.1373 1.7433 1.9506 1.8798 1.5320 1.6785 1.3402 1.8732 1.1885 1.2710 1.3553 2.3093 1.5070 1.6225 4.7750 4.6364 1.2145 1.1665 3.1836 1.1073 3.3046 2.6852 1.0647 1.0429 1.0670 1.0887 3.5411 2.2888 6.8683 6.6261 4.8152 7.0275 6.7957 1.0592 1.0587 1.0364 1.0643 1.0610 1.0972 1.0995 1.0992 1.1025 1.1008 1.0997 1.0883 1.0852 1.0895 1.0947 1.0956 1.1003 1.0935 1.0763
irintensity: 0.3251 0.9478 1.6997 0.4063 6.3806 1.6260 0.4786 2.5235 0.5705 0.5911 0.1526 0.2762 2.4444 10.3316 4.9519 5.1537 0.9944 4.0385 13.6136 0.0229 2.8676 0.5777 1.3968 0.5564 1.7314 5.8909 7.1652 2.6225 49.4816 4.1951 0.3307 10.3400 8.1139 53.3288 1.4319 54.1624 0.3140 0.5093 43.0215 0.1212 5.9070 4.3109 3.8231 13.8346 6.1949 3.1072 0.8517 23.3561 1.9658 3.1330 6.1901 0.0993 7.2404 19.8174 4.8953 9.4760 5.7892 0.0141 20.6211 0.0170 41.2452 36.8245 9.1691 10.7248 24.0920 28.4934 5.1115 1.9111 17.4526 13.1007 15.9911 10.2653 2.5447 92.7904 32.7416 14.5866 20.5371 28.7862 9.9561 199.8639 16.5605 1.8874 12.3997 2.7427 30.0626 222.6012 218.4311 6.5045 85.5844 81.1232 12.6340 31.9103 25.1737 22.0897 34.1145 41.8829 13.6834 18.3525 6.4991 6.8755 13.2812 90.0087 57.9132 25.1854 3.6786 3.1327 23.3434 25.7809 44.3448 5.6847 11.3559
temp: 298.150 k
press: 1.00000 atm
elementType: 8 7 6 6 6 6 6 6 6 6 6 6 6 6 6 6 6 6 6 6 1 1 1 1 1 1 1 1 1 1 1 1 1 1 1 1 1 1 1
symmnumber: 1
zpe: 846348.8 jmol-1
zpe.correction: 0.322357 hartree
zpe.thermalcorrener: 0.340437 hartree
zpe.thermalcorrenthalpy: 0.341381 hartree
zpe.thermalcorrgfe: 0.274126 hartree
zpe.sumelectzpe: -825.904354 hartree
zpe.sumelectthermal: -825.886274 hartree
zpe.sumelectthermalent: -825.885329 hartree
zpe.sumelectthermalfe: -825.952585 hartree
dipole: -1.0466 2.8654 0.2062
dipole: 3.0575
quadrupole: -103.2192 -107.7456 -123.8448
quadrupole: -10.7961 0.7689 0.0051
quadrupole: 8.3840 3.8576 -12.2416 -10.7961 0.7689 0.0051
hfenergy: -826.2267109 hartree
pointgroup: C01 [X(C18H19N1O1)]
dipole: 0.4124086 1.1006068 -0.2560456 debye
polarizability: 374.8326821|9.4514114|194.6489878|13.4774946|-19.6582522|109.2486209 unknown
InChI: InChI=1S/C18H19NO/c1-2-3-8-18(20)19-15-9-10-17-14(12-15)11-13-6-4-5-7-16(13)17/h4-7,9-10,12,19H,2-3,8,11H2,1H3
charge 0 multiplicity 1
39 atoms
O  2.937381 -1.20518 0.79315
N  2.225781 0.948538 0.182657
C  -1.242942 -0.490503 0.232278
C  -2.173585 -1.679954 0.441468
C  -2.00559 0.664775 -0.117876
C  -3.553307 -1.086873 0.175997
C  -3.432793 0.299386 -0.152753
C  0.154885 -0.44632 0.344313
C  -1.348351 1.89122 -0.361336
C  0.811112 0.792816 0.097558
C  -4.816086 -1.702509 0.216722
C  -4.581499 1.070133 -0.440973
C  0.05469 1.948669 -0.252574
C  5.634529 -0.401037 -0.141852
C  4.631665 0.552538 0.55058
C  -5.968876 -0.928351 -0.072579
C  -5.850033 0.446095 -0.39824
C  3.199035 0.004691 0.51868
C  7.102415 0.037066 0.056212
C  8.101571 -0.911114 -0.641232
H  -2.088829 -2.092842 1.46579
H  -1.938713 -2.511287 -0.251845
H  0.749526 -1.321901 0.611678
H  -1.911326 2.791365 -0.631012
H  -4.915342 -2.765019 0.467841
H  -4.49824 2.133346 -0.693983
H  0.57488 2.89755 -0.438896
H  5.48139 -1.417602 0.266198
H  5.405437 -0.457819 -1.225009
H  4.921588 0.657277 1.616207
H  4.690293 1.564228 0.101266
H  2.572329 1.8878 -0.025751
H  -6.959917 -1.395119 -0.044404
H  -6.751327 1.029207 -0.619049
H  7.326057 0.078024 1.142087
H  7.239598 1.068383 -0.329672
H  9.145922 -0.584121 -0.485327
H  7.917595 -0.948926 -1.731442
H  8.006778 -1.941329 -0.250077
