program: Gaussian 09
title: 000148961
version: EM64L-G09RevD.01
frameworkgroup: C1[X(C14H24N6O4)]
method: RPBEPBE
basis: SDD
operation: Freq
keyword: #p
keyword: freq=noraman
keyword: PBEPBE/SDD
title: #p freq=noraman PBEPBE/SDD
converged: YES YES NO NO
title: Mulliken charges:
elementType: O O O O N N N N N N C C C C C C C C C C C C C C H H H H H H H H H H H H H H H H H H H H H H H H
charge: -0.397113 -0.244890 -0.291959 -0.322699 -0.402501 -0.366763 -0.605527 -0.607857 -0.419717 -0.118918 -0.409964 -0.370233 -0.144491 -0.356509 -0.384477 -0.199146 -0.555660 0.134731 0.241426 -0.484810 0.308137 0.404275 -0.481497 -0.211260 0.237057 0.262430 0.191374 0.200421 0.296713 0.212870 0.209032 0.347429 0.214693 0.150890 0.202357 0.256653 0.217691 0.261406 0.259884 0.343845 0.286768 0.282162 0.324829 0.255679 0.361577 0.265836 0.391033 0.254790
chargesum: 0.00000
title: Mulliken charges with hydrogens summed into heavy atoms:
elementType: O O O O N N N N N N C C C C C C C C C C C C C C
charge: -0.006080 -0.244890 -0.291959 -0.322699 -0.055072 -0.022918 -0.036597 -0.027349 -0.058140 -0.118918 0.089524 0.021562 0.152222 0.065394 -0.031229 0.015548 -0.081316 0.134731 0.241426 0.036480 0.308137 0.404275 -0.215661 0.043530
chargesum: -0.00006
polarizability: 2.27395488e+02 1.34643211e+01 2.01850070e+02 1.14076495e+01 -1.12442811e+00 1.70094159e+02
1716.lowfreq: -8.0077 -4.5516 -0.9187 -0.7201 -0.0673 0.0004 23.3929 27.0821 30.2954
frequency: 23.1719 27.0306 30.2345 40.2920 58.6701 68.5493 76.5795 81.4814 84.3390 92.7810 104.2643 105.0817 126.6827 138.7741 146.2138 156.2019 159.9576 174.9572 203.4217 214.4912 247.9282 263.9576 276.0013 299.2803 313.3159 320.8734 341.0392 348.2724 356.1390 378.4296 412.7701 461.4430 471.2660 505.3738 510.8668 568.5142 592.0789 616.1562 635.0960 645.8248 649.3395 657.4433 686.6755 700.5600 725.0829 727.0646 737.9370 762.2626 772.7718 782.0471 788.6018 793.5303 826.7413 830.7870 864.2473 887.5524 907.3189 918.0811 942.9450 965.9085 971.9779 990.2205 1000.7748 1007.9263 1031.7955 1048.4949 1061.4836 1078.4517 1085.9409 1094.7906 1098.7755 1106.9514 1116.1814 1125.8989 1153.8413 1158.7324 1191.8913 1198.4944 1199.3799 1226.6867 1230.2581 1232.7215 1242.6673 1242.9814 1256.4670 1271.8983 1282.1887 1287.4879 1292.2031 1308.4538 1318.9378 1324.3896 1336.0888 1353.2977 1354.8935 1371.5073 1375.9889 1383.1257 1385.1477 1433.9547 1456.1310 1460.9325 1462.5225 1464.3328 1475.3757 1485.5137 1487.5987 1496.1314 1561.4367 1599.6607 1615.0009 1634.8848 1648.6107 1671.3360 2811.6446 2854.4467 2956.3989 2978.8518 2986.2427 2994.5585 3001.4650 3002.6511 3009.7925 3023.8872 3047.1272 3063.6608 3067.9276 3075.8476 3224.8018 3241.3958 3345.4690 3470.1592 3476.2490 3485.2360 3497.8564 3519.9459 3539.5839 3618.3228
redmass: 6.1159 6.2159 6.0703 5.5164 9.2837 4.8631 4.4801 5.8208 4.6492 4.5720 3.1070 2.0268 3.9423 4.8460 3.5652 1.2699 2.5523 3.2675 3.1779 4.8874 5.9027 4.5808 3.9725 4.0831 2.7782 4.3821 2.2222 2.0087 1.8798 4.9285 3.4892 2.1090 1.8393 2.7929 3.5351 3.4788 2.3000 3.4735 1.6179 2.6690 1.5028 3.5435 1.3172 4.6297 2.1840 2.2988 1.6818 2.5908 1.8675 1.3367 1.2521 1.2148 2.4277 1.8681 3.3845 1.7018 5.3908 2.6176 2.2747 2.8221 2.5802 2.3471 3.1074 2.2877 2.1367 3.4283 2.3227 3.2690 2.2546 2.4611 3.1727 2.4415 2.2115 1.6838 1.2603 1.7191 1.2411 1.4138 1.4691 1.7154 1.4176 2.3177 1.4762 1.4710 1.3562 1.3787 1.2597 1.0479 1.2218 1.2395 1.5076 1.5054 1.3406 2.4878 1.8054 1.9102 2.3771 1.9247 1.5897 2.9355 1.1082 1.0716 1.0919 1.0943 1.0990 1.1000 2.2179 2.1889 4.8422 7.5961 5.9560 1.1059 8.0855 1.0843 1.0715 1.0822 1.0592 1.0616 1.0641 1.0850 1.0596 1.0980 1.0641 1.0801 1.1035 1.1020 1.0971 1.1035 1.0978 1.0995 1.0560 1.0830 1.0781 1.0445 1.0783 1.0642 1.0886 1.0998
irintensity: 0.0480 1.3882 1.1268 0.7252 0.5094 1.0897 5.8970 2.4015 15.9197 6.8713 0.6692 0.3054 14.3124 14.3111 5.8417 27.9686 2.1016 1.9361 3.4395 1.4889 1.3041 7.1786 21.8818 11.4527 3.3102 2.3256 43.2157 27.9640 41.3100 21.4786 16.5163 122.7246 113.0207 26.9990 44.8555 43.2524 16.5985 10.5161 15.7326 48.6061 138.5400 29.1051 158.2407 14.0050 10.2050 7.4334 30.6639 31.5113 77.3758 144.7578 58.7658 82.4029 29.9145 45.0530 9.3442 1.3443 15.7917 18.5329 7.3793 11.5613 8.2599 14.4117 3.6962 4.1786 34.3950 78.7737 144.9242 28.8019 14.5385 24.5901 30.8121 12.3334 22.7865 14.1346 5.5544 2.7604 24.6819 4.7159 4.9770 20.4661 12.9892 7.9636 3.3512 0.1994 0.1504 5.6604 13.7006 0.2785 11.0601 14.0741 1.6708 24.8289 6.9443 19.4912 19.5731 109.3748 21.3586 8.2507 19.7899 10.3794 18.2436 0.7174 33.9860 10.3112 13.8961 15.4360 336.8212 121.3698 42.7492 273.2080 80.1405 51.4452 155.3151 31.8933 130.3611 82.4345 20.8243 23.5363 30.2053 60.4624 29.0929 2.7911 13.8865 13.8411 84.6742 10.0280 7.1609 32.9797 6.4645 1.4595 179.9056 155.9630 79.0764 1.5169 82.8042 40.6287 25.3582 2.6960
temp: 298.150 k
press: 1.00000 atm
elementType: 8 8 8 8 7 7 7 7 7 7 6 6 6 6 6 6 6 6 6 6 6 6 6 6 1 1 1 1 1 1 1 1 1 1 1 1 1 1 1 1 1 1 1 1 1 1 1 1
symmnumber: 1
zpe: 1032682.5 jmol-1
zpe.correction: 0.393328 hartree
zpe.thermalcorrener: 0.419278 hartree
zpe.thermalcorrenthalpy: 0.420223 hartree
zpe.thermalcorrgfe: 0.335154 hartree
zpe.sumelectzpe: -1175.461877 hartree
zpe.sumelectthermal: -1175.435927 hartree
zpe.sumelectthermalent: -1175.434982 hartree
zpe.sumelectthermalfe: -1175.520051 hartree
dipole: 1.2554 -3.8028 0.3057
dipole: 4.0163
quadrupole: -117.4221 -153.8149 -150.5259
quadrupole: 4.9482 14.7530 11.6293
quadrupole: 23.1655 -13.2273 -9.9382 4.9482 14.7530 11.6293
hfenergy: -1175.855205 hartree
pointgroup: C01 [X(C14H24N6O4)]
dipole: -0.6011014 -1.4544685 -0.1413798 debye
polarizability: 225.7815164|-15.3581765|203.8413757|10.0410424|1.3716138|169.7168246 unknown
InChI: InChI=1S/C14H24N6O4/c15-4-2-1-3-11(14(23)24)20-12(21)7-18-13(22)10(16)5-9-6-17-8-19-9/h6,8,10-11,18-20,23H,1-5,7,15-16H2
charge 0 multiplicity 1
48 atoms
O  -5.607313 -0.369466 0.072561
O  -4.418126 -0.912316 -1.848744
O  -1.006485 -2.269744 1.451364
O  2.352005 -1.670053 -1.902443
N  -2.213806 -1.617057 -0.426995
N  1.248416 -2.545884 -0.05408
N  4.419863 -2.768074 0.333438
N  -0.299668 4.651742 0.343776
N  2.614134 1.077724 -1.441036
N  2.276967 2.875988 -0.12115
C  -2.847374 0.353316 1.018262
C  -2.450065 1.464179 0.021516
C  -3.296592 -0.988271 0.349033
C  -1.626855 2.583124 0.699187
C  -1.318228 3.766388 -0.246663
C  3.493639 -1.624205 0.315779
C  4.265943 -0.356646 -0.15101
C  -4.463409 -0.772372 -0.60385
C  -1.134039 -2.194129 0.185631
C  -0.032208 -2.751234 -0.738649
C  2.330059 -1.944339 -0.657641
C  3.415769 0.8749 -0.306682
C  3.194184 2.004725 0.492036
C  1.947102 2.279482 -1.290174
H  -3.669057 0.696994 1.67328
H  -1.991909 0.099743 1.670389
H  -1.844112 1.032633 -0.801899
H  -3.35793 1.896002 -0.449234
H  -3.611349 -1.675951 1.15668
H  -2.148968 2.97213 1.594902
H  -0.666508 2.158874 1.055939
H  -2.29788 -1.576259 -1.448387
H  3.042273 -1.395168 1.31424
H  -1.031828 3.34408 -1.247245
H  -2.245674 4.349837 -0.414493
H  4.759144 -0.615561 -1.10589
H  5.060093 -0.151665 0.591258
H  0.016547 -2.242762 -1.71722
H  -0.220017 -3.82777 -0.921132
H  1.197285 -2.615359 0.969744
H  5.338282 -2.578361 0.74089
H  4.022473 -3.666903 0.613589
H  0.63362 4.21058 0.402751
H  -0.258111 5.583226 -0.081234
H  2.493852 0.352313 -2.158038
H  3.635992 2.24576 1.456527
H  -6.345642 -0.209178 -0.575668
H  1.253411 2.679485 -2.025315
