program: Gaussian 09
title: 000148887
version: EM64L-G09RevD.01
frameworkgroup: C1[X(C3H10N2O6S2)]
method: RPBEPBE
basis: SDD
operation: Freq
keyword: #p
keyword: freq=noraman
keyword: PBEPBE/SDD
title: #p freq=noraman PBEPBE/SDD
converged: NO YES NO NO
title: Mulliken charges:
elementType: S S O O O O O O N N C C C H H H H H H H H H H
charge: 1.166744 1.166747 -0.410297 -0.410300 -0.496562 -0.496502 -0.496557 -0.496515 -0.743819 -0.743844 -0.387591 -0.253322 -0.253335 0.240380 0.240390 0.229804 0.229484 0.229580 0.229738 0.364026 0.363857 0.364015 0.363880
chargesum: 0.00000
title: Mulliken charges with hydrogens summed into heavy atoms:
elementType: S S O O O O O O N N C C C
charge: 1.166744 1.166747 -0.410297 -0.410300 -0.496562 -0.496502 -0.496557 -0.496515 -0.015935 -0.015949 0.093178 0.205965 0.205983
polarizability: 1.87798101e+02 -3.20130903e-05 1.02786406e+02 -5.62617307e-02 2.28452331e-02 1.07228438e+02
1716.lowfreq: -6.5679 -4.0480 -1.0743 -0.0022 -0.0018 0.0027 4.2508 7.6347 21.1829
frequency: 4.2348 7.1137 20.7850 43.0584 56.3422 93.5840 97.0312 111.0304 126.2678 172.6534 184.4608 184.9698 234.4051 274.1727 292.5495 297.9398 300.2488 329.3639 345.0614 345.3269 347.5523 361.0858 409.1280 429.2281 465.5511 568.1077 586.9460 721.9114 725.0057 797.9864 866.7358 868.5326 893.2434 897.9316 930.2256 930.3293 947.7512 1056.7796 1057.3696 1088.5316 1089.2024 1127.7001 1172.3785 1259.6062 1271.7078 1283.8018 1361.5470 1368.0747 1473.1470 1484.2105 1495.3972 1534.0763 1534.1597 2981.0109 2984.9603 3031.2134 3047.9060 3048.9571 3102.8671 3475.5521 3475.9701 3657.2044 3657.2653
redmass: 8.1870 8.3242 9.8415 6.3710 2.5604 2.3961 4.8921 2.2139 13.0641 2.9342 1.6416 1.6513 2.7121 6.3166 3.1471 4.0048 4.0424 3.1731 2.4480 2.4596 3.6861 5.7804 6.9338 5.6793 6.3496 13.2847 8.0956 4.5522 4.6452 1.0722 11.2301 11.1365 1.1729 9.9630 2.8815 2.8486 8.5288 5.3177 2.9999 1.8682 1.8775 1.4984 1.1354 1.2146 1.0795 1.2498 1.2319 1.3767 1.0712 1.0812 1.0869 1.0863 1.0864 1.0542 1.0549 1.0582 1.1078 1.1105 1.1068 1.0402 1.0402 1.1069 1.1069
irintensity: 0.0004 0.0012 0.0000 0.4034 4.1455 0.2354 52.6422 0.0011 0.0486 0.5864 0.0003 41.1776 111.0783 21.7191 7.8046 0.0061 2.6632 255.5565 0.1509 39.3709 10.5104 41.9914 14.5171 10.3336 490.4657 4.7103 268.3578 33.5126 50.3223 5.0111 110.7985 218.2887 0.0007 88.4082 77.4913 0.1309 25.8944 11.8267 0.9527 0.0096 133.5178 2.4433 0.0000 0.2397 0.0006 16.4310 0.0004 27.5289 1.5573 20.6960 11.9775 0.2680 55.8819 19.6728 36.9155 14.6525 20.4894 0.0855 28.6581 59.2567 103.7593 4.6338 115.6539
temp: 298.150 k
press: 1.00000 atm
elementType: 16 16 8 8 8 8 8 8 7 7 6 6 6 1 1 1 1 1 1 1 1 1 1
symmnumber: 1
zpe: 409053.8 jmol-1
zpe.correction: 0.155800 hartree
zpe.thermalcorrener: 0.173861 hartree
zpe.thermalcorrenthalpy: 0.174805 hartree
zpe.thermalcorrgfe: 0.103508 hartree
zpe.sumelectzpe: -1475.814786 hartree
zpe.sumelectthermal: -1475.796725 hartree
zpe.sumelectthermalent: -1475.795781 hartree
zpe.sumelectthermalfe: -1475.867078 hartree
dipole: 0.0000 6.8074 -0.0167
dipole: 6.8075
quadrupole: -105.6586 -86.6152 -99.4265
quadrupole: 0.0001 0.2091 0.0011
quadrupole: -8.4251 10.6182 -2.1931 0.0001 0.2091 0.0011
hfenergy: -1475.9705861 hartree
pointgroup: C01 [X(C3H10N2O6S2)]
dipole: -0.0008563 2.6782387 0.0117302 debye
dipolederiv: 2.4425567 0.1593533 -0.0001359 -0.0701199 1.7150913 0.0033477 -0.0023944 0.0021148 1.4203386 2.4426548 -0.1589056 0.0007623 0.0706542 1.7150477 -0.0012324 0.0017369 -0.0004505 1.4202881 -1.2919131 -0.1024414 0.0007855 0.0223515 -0.4903185 -0.0000979 0.0030525 0.0000459 -0.4467684 -1.2919731 0.1018928 -0.0005208 -0.0229852 -0.4902409 0.0000243 -0.0004945 -0.0002519 -0.4467449 -0.6555741 0.0162482 -0.0303022 0.1043303 -0.5002803 0.000593 -0.1259245 0.1201033 -0.6022437 -0.6550814 0.0158341 0.0314815 0.1014356 -0.4981556 0.0012687 0.1284142 -0.1180138 -0.6048155 -0.6549267 -0.0157801 -0.0302992 -0.1033573 -0.4994453 0.0000083 -0.1266928 -0.1194633 -0.60336 -0.655581 -0.0165043 0.0315021 -0.1026027 -0.4991206 -0.000601 0.1274808 0.1188376 -0.6037142 -1.1129778 -0.0775365 -0.0015161 -0.2784433 -0.8409141 -0.0033487 -0.0034633 -0.0031662 -0.4083905 -1.1132877 0.0773682 -0.002389 0.2782634 -0.84074 0.0008591 -0.0034995 0.0003812 -0.40838 -0.3371179 -0.0001456 0.0004967 -0.0002068 0.0627897 0.0007006 0.0004529 -0.0000405 0.1410934 0.6299054 0.0714288 -0.0004625 0.454952 0.2609456 -0.0013388 0.0008054 -0.0001348 0.3154848 0.63028 -0.0711443 -0.0000194 -0.4545744 0.2605496 -0.0012659 -0.0001497 -0.0002756 0.3154384 0.1191177 -0.0001549 -0.0001728 -0.0002721 0.0130435 -0.0798212 -0.0003525 -0.0932594 -0.0318978 0.1195909 0.0002348 -0.0002268 0.0003543 0.0122054 0.0799961 -0.0004403 0.0933976 -0.0308831 -0.0128457 -0.0008669 -0.0165308 -0.0847877 -0.0101732 0.0702105 0.0143021 0.1061145 -0.0487005 -0.0127614 -0.0015377 0.0163167 -0.0851565 -0.0094337 -0.0696773 -0.0148271 -0.1061539 -0.0501166 -0.0132752 0.0012575 0.0163062 0.084861 -0.0100951 0.0701649 -0.0145144 0.1063034 -0.0493405 -0.0124377 0.0011344 -0.0164644 0.0850365 -0.0093633 -0.0697064 0.0147195 -0.1059149 -0.0494217 0.3593987 -0.0469076 -0.0665097 -0.0596696 0.1650294 0.012648 -0.1444023 -0.0689617 0.1922935 0.3584799 -0.048126 0.0664617 -0.0616004 0.1642021 -0.0138652 0.1444494 0.0681045 0.1937617 0.3599072 0.04733 -0.0657516 0.0608313 0.1647144 -0.012721 -0.143593 0.0687933 0.1922169 0.3578616 0.0479691 0.0671884 0.060706 0.1646616 0.0138548 0.1453345 -0.0681099 0.1938619 unknown
polarizability: 187.7978603|0.0276736|102.7865198|-0.1478389|-0.0314808|107.2285654 unknown
InChI: InChI=1S/C3H10N2O6S2/c4-12(6,7)10-2-1-3-11-13(5,8)9/h1-5H2
charge 0 multiplicity 1
23 atoms
S  4.075088 -0.154988 -0.010908
S  -4.075521 -0.157634 -0.000151
O  2.389814 0.669257 -0.003081
O  -2.390765 0.667746 0.002664
O  4.275666 -0.91524 1.393511
O  4.277486 -0.88825 -1.429245
O  -4.27166 -0.907774 -1.410613
O  -4.281424 -0.90133 1.412253
N  5.061548 1.289814 0.002565
N  -5.062872 1.286595 -0.006068
C  -0.00046 0.57873 0.001191
C  1.263636 -0.299412 -0.003713
C  -1.263948 -0.300304 0.000936
H  0.000925 1.224059 0.896612
H  -0.002304 1.229073 -0.890595
H  1.316192 -0.935611 0.90106
H  1.31236 -0.930367 -0.912408
H  -1.313674 -0.934856 0.907027
H  -1.314783 -0.932865 -0.906495
H  5.076289 1.811455 -0.877785
H  5.071077 1.799151 0.890157
H  -5.08024 1.802115 0.877831
H  -5.070528 1.802037 -0.890144
