program: Gaussian 09
title: 000148945
version: EM64L-G09RevD.01
frameworkgroup: C1[X(C20H18N4O2S)]
method: RPBEPBE
basis: SDD
operation: Freq
keyword: #p
keyword: freq=noraman
keyword: PBEPBE/SDD
title: #p freq=noraman PBEPBE/SDD
converged: YES YES NO NO
title: Mulliken charges:
elementType: S O O N N N N C C C C C C C C C C C C C C C C C C C C H H H H H H H H H H H H H H H H H H
charge: 0.978463 -0.545158 -0.537336 -0.495325 -0.087345 -0.490522 -0.660919 0.205208 0.346557 0.223631 -0.214271 -0.092776 0.445388 -0.466367 0.369440 -0.338176 -0.317903 -0.220708 -0.442608 -0.445294 -0.316556 0.268339 -0.264220 -0.239806 -0.288646 -0.366500 -0.764843 0.311764 0.221546 0.268720 0.259071 0.221580 0.225853 0.236228 0.272884 0.233500 0.233912 0.287553 0.228999 0.269839 0.346376 0.304928 0.261900 0.295646 0.277954
chargesum: 0.00000
title: Mulliken charges with hydrogens summed into heavy atoms:
elementType: S O O N N N N C C C C C C C C C C C C C C C C C C C C
charge: 0.978463 -0.545158 -0.537336 -0.183560 -0.087345 -0.220683 -0.009615 0.205208 0.346557 0.223631 -0.214271 -0.092776 0.445388 -0.244821 0.369440 -0.069456 -0.058832 0.000872 -0.216755 -0.209066 -0.043671 0.268339 -0.030720 -0.005895 -0.001093 -0.137501 0.070656
polarizability: 6.09472505e+02 9.00229967e+00 3.47878151e+02 1.21010371e+01 -1.32780133e+01 1.90059494e+02
1716.lowfreq: -7.6371 -2.9153 -2.3234 -0.0020 -0.0014 -0.0009 14.5634 16.5159 30.0553
frequency: 14.4512 16.2964 30.0389 37.1278 48.2862 70.8962 83.9594 99.0577 112.2526 127.4378 148.8311 162.5674 176.0267 191.4296 197.0507 208.3694 240.7641 264.3621 269.4852 289.7847 317.2210 317.6554 346.8978 365.8954 390.9522 395.8290 404.5498 410.3487 420.8427 440.7971 460.7236 496.2786 503.4477 514.2423 526.2186 540.2681 543.6034 557.0989 580.3451 585.4629 611.8261 626.9857 637.6950 644.5868 656.9781 705.3449 727.1096 739.5089 762.9476 766.6630 775.3481 806.8427 812.2312 819.7759 823.5592 829.0829 835.8810 851.3899 852.5820 864.5137 874.1092 890.4534 901.0824 946.4572 949.0148 957.9563 962.2456 967.9632 992.5473 994.2063 995.9297 1003.8200 1022.7335 1052.9790 1092.3229 1108.6945 1116.8285 1156.9079 1179.8080 1183.6047 1193.5897 1197.6456 1244.5173 1256.9132 1264.0014 1279.9385 1280.6748 1297.3052 1316.4551 1329.4151 1359.0901 1366.3210 1378.4643 1409.5344 1415.9870 1416.7074 1431.1900 1435.6207 1439.5914 1470.5537 1473.9605 1484.2976 1496.8651 1528.5629 1548.4036 1560.7319 1571.0013 1587.1655 1613.3833 1618.7539 1627.3418 3029.5226 3118.2817 3125.2034 3125.5431 3134.1382 3139.8630 3148.2817 3158.6329 3164.8555 3168.0200 3174.5226 3177.3337 3179.9399 3183.9073 3343.6214 3500.9700 3507.6000 3684.8850
redmass: 5.6055 7.0973 5.7515 5.1432 5.6403 4.6451 4.5792 4.8572 5.7972 6.1614 5.5735 1.3382 2.8962 5.1547 4.4643 4.7989 4.1449 4.6922 4.8261 4.4955 4.8207 6.6509 4.8924 6.7387 4.2267 5.5085 3.2657 1.3321 2.9976 2.9106 4.2584 2.6744 3.5282 3.1030 3.0193 6.0135 3.4404 3.8576 4.0001 3.4571 5.8611 6.3948 1.8970 2.1517 4.7292 4.9709 3.9267 1.6812 2.0497 3.4324 1.9683 4.7502 1.5033 4.2343 4.6201 2.3390 3.3745 1.5434 1.4249 3.5909 1.9015 2.1560 5.6413 1.3207 1.3442 1.3263 1.3686 1.3531 1.3613 2.5622 2.3593 2.2954 2.0601 3.1587 2.4764 1.6117 1.4055 1.2507 1.2146 1.1822 1.1767 1.3646 2.4996 2.7698 2.5540 1.6417 1.2390 2.9311 2.0553 1.8235 3.3356 2.5209 3.7530 1.0593 2.7023 1.0617 7.8843 4.0943 3.4374 3.3917 2.3923 2.9566 3.0803 5.3002 6.1423 2.8079 3.5457 1.9031 6.1319 5.2249 5.4067 1.0239 1.0898 1.0904 1.0853 1.0857 1.0909 1.0893 1.0987 1.0956 1.0942 1.0992 1.0955 1.1072 1.1080 1.0752 1.0481 1.0745 1.1004
irintensity: 4.2773 2.2738 1.3793 1.5087 0.7521 1.2651 6.6021 9.3303 10.7342 36.7252 48.2466 13.3758 25.5442 0.7381 9.1789 7.8928 0.7688 12.1716 10.1471 2.0972 17.4212 15.5097 38.4093 9.0504 12.4548 19.4328 41.7740 86.2185 3.6750 40.1156 4.6622 128.6591 6.2565 109.5973 18.4995 9.8024 26.4816 28.4798 20.6576 31.2301 4.7260 9.5990 33.7576 64.0100 27.5317 13.9680 10.2608 46.4839 2.7026 27.2693 77.1389 82.8616 35.6689 7.0033 6.5320 53.8790 45.7067 10.5065 85.2078 4.9379 2.3182 14.0997 8.2246 91.8332 72.9161 1.6311 1.4731 1.9811 0.1808 2.4804 2.9812 43.1568 6.0996 10.2976 11.4087 23.3440 19.5498 18.2166 54.4938 5.0605 1.3296 0.8525 7.3148 31.2790 57.1032 20.5275 3.8175 36.0516 18.8171 32.8131 20.8896 5.9536 154.3870 5.9941 2.5427 10.7370 413.7647 44.2070 5.4970 10.1092 17.7419 300.5142 351.0014 53.0462 21.9879 19.6142 37.7701 202.2715 351.2740 169.2846 135.6375 0.7663 12.1204 10.9552 6.5896 4.1809 29.1894 7.0400 34.4431 23.7863 4.7028 22.7790 1.0657 0.1034 1.2750 11.7530 78.6536 47.0074 70.0863
temp: 298.150 k
press: 1.00000 atm
elementType: 16 8 8 7 7 7 7 6 6 6 6 6 6 6 6 6 6 6 6 6 6 6 6 6 6 6 6 1 1 1 1 1 1 1 1 1 1 1 1 1 1 1 1 1 1
symmnumber: 1
zpe: 893411.7 jmol-1
zpe.correction: 0.340283 hartree
zpe.thermalcorrener: 0.364838 hartree
zpe.thermalcorrenthalpy: 0.365782 hartree
zpe.thermalcorrgfe: 0.283707 hartree
zpe.sumelectzpe: -1538.409681 hartree
zpe.sumelectthermal: -1538.385126 hartree
zpe.sumelectthermalent: -1538.384182 hartree
zpe.sumelectthermalfe: -1538.466258 hartree
dipole: -8.4127 -1.0439 -2.5920
dipole: 8.8646
quadrupole: -210.3371 -148.1368 -159.3297
quadrupole: 4.6606 -6.0200 -0.1653
quadrupole: -37.7359 24.4644 13.2715 4.6606 -6.0200 -0.1653
hfenergy: -1538.749964 hartree
pointgroup: C01 [X(C20H18N4O2S1)]
dipole: 3.2253256 -1.0217902 0.8465165 debye
polarizability: 602.4560401|-45.0162066|345.0399124|5.686923|40.7247476|199.9141977 unknown
InChI: InChI=1S/C20H18N4O2S/c1-27(25,26)24-14-11-9-13(10-12-14)22-19-15-5-2-3-8-18(15)23-20-16(19)6-4-7-17(20)21/h2-12,22,24H,21H2,1H3
charge 0 multiplicity 1
45 atoms
S  -6.362087 0.20943 0.549954
O  -7.62279 0.857493 1.350307
O  -6.522483 -0.411066 -0.94474
N  0.161918 -0.187284 -1.256502
N  4.010726 -0.227327 0.639695
N  -4.937062 1.678247 0.399367
N  5.536254 -2.427577 0.723201
C  1.414805 -0.175775 -0.591962
C  2.159469 -1.400445 -0.537294
C  1.982886 1.027606 -0.059409
C  3.475173 -1.348585 0.077906
C  3.288924 0.937227 0.585555
C  -1.081392 0.284925 -0.793895
C  1.67152 -2.654605 -1.039067
C  4.296642 -2.557103 0.134686
C  1.369594 2.324279 -0.176417
C  3.8729 2.119821 1.157443
C  2.483141 -3.791359 -0.967573
C  3.789864 -3.756059 -0.399626
C  -2.179379 0.322593 -1.706906
C  -1.294124 0.68917 0.557133
C  -3.657329 1.189493 0.052399
C  1.975347 3.45345 0.369505
C  3.22994 3.35034 1.0612
C  -3.440851 0.771855 -1.297127
C  -2.566824 1.109905 0.971977
C  -5.641305 -1.218537 1.639991
H  0.12285 -0.766268 -2.099407
H  0.65517 -2.739817 -1.43627
H  0.421395 2.424683 -0.71111
H  4.843472 2.010216 1.651144
H  2.103417 -4.746986 -1.347012
H  4.393232 -4.670139 -0.3649
H  -2.025417 0.016997 -2.749063
H  -0.471613 0.647431 1.276296
H  1.496091 4.432701 0.263567
H  3.685043 4.247505 1.494559
H  -4.277464 0.82291 -1.999911
H  -2.721811 1.39925 2.019723
H  -4.978606 2.091348 1.353402
H  5.777436 -1.501176 1.081017
H  6.175753 -3.210888 0.811071
H  -5.57672 -0.830049 2.665468
H  -6.368231 -2.037278 1.546686
H  -4.663076 -1.478853 1.213139
