program: Gaussian 09
title: 000148890
version: EM64L-G09RevD.01
frameworkgroup: C1[X(C17H17NO)]
method: RPBEPBE
basis: SDD
operation: Freq
keyword: #p
keyword: freq=noraman
keyword: PBEPBE/SDD
title: #p freq=noraman PBEPBE/SDD
converged: YES YES NO NO
title: Mulliken charges:
elementType: O N C C C C C C C C C C C C C C C C C H H H H H H H H H H H H H H H H H
charge: -0.260609 -0.468315 0.319101 -0.697576 0.185529 0.274205 0.185562 -0.567758 -0.386111 0.515166 -0.422609 -0.397390 -0.493413 -0.220313 -0.238539 -0.234848 0.212212 -0.680329 -0.680348 0.248135 0.248074 0.319678 0.239217 0.241095 0.235827 0.219235 0.197929 0.302059 0.224532 0.224210 0.216975 0.215027 0.246172 0.215021 0.216978 0.246217
chargesum: 0.00000
title: Mulliken charges with hydrogens summed into heavy atoms:
elementType: O N C C C C C C C C C C C C C C C C C
charge: -0.260609 -0.166255 0.319101 -0.201368 0.185529 0.274205 0.185562 -0.248080 -0.146894 0.515166 -0.181514 -0.161563 -0.274178 -0.022384 -0.014007 -0.010638 0.212212 -0.002155 -0.002132
polarizability: 3.53569970e+02 -2.86405188e+00 1.88532458e+02 -1.51996233e-02 5.91333554e-02 9.87417392e+01
1716.lowfreq: -6.5000 -5.5536 -0.0003 0.0006 0.0007 3.9895 19.9130 38.6894 49.7007
frequency: 19.9029 38.6512 49.6882 79.6211 104.7332 140.3588 180.2898 197.3116 203.9307 209.1492 239.6185 247.8731 270.0344 294.4765 343.7167 360.3909 374.1626 423.0514 436.5179 452.7739 499.7122 510.1113 546.1389 596.0241 601.1878 635.6975 655.9730 659.3149 707.6352 720.2183 724.9825 742.4368 757.7331 777.4440 821.2870 825.4326 858.8325 869.0997 910.0356 920.0773 923.4155 942.9716 943.8094 945.3927 962.6362 976.0411 984.6545 994.5499 1025.0016 1092.1686 1096.9290 1106.9607 1122.1351 1131.2546 1135.8100 1167.5234 1171.0266 1185.4346 1190.8421 1201.8474 1226.6743 1274.6665 1286.1397 1292.3335 1310.1898 1339.7647 1373.8219 1374.0940 1387.2365 1393.4335 1425.5184 1442.1416 1451.7979 1459.3426 1461.6173 1472.7644 1476.1373 1489.1527 1492.4682 1508.0093 1590.2430 1593.8660 1619.3660 1621.3627 1628.4058 2964.3787 2983.1654 2983.6991 2985.6053 3027.8483 3078.1022 3082.4219 3091.6924 3097.4825 3110.0417 3120.0843 3127.0753 3140.6692 3143.9700 3160.1920 3180.9234 3526.1385
redmass: 3.1128 3.7489 5.9538 4.4692 4.8072 3.8247 4.4031 1.7796 2.7159 1.5170 2.1316 1.3524 4.2345 2.8993 7.0009 4.2912 3.1843 2.6993 2.9129 4.1847 3.9682 3.2524 6.0249 2.8839 5.9031 5.5834 1.1702 3.2605 3.0254 6.0228 5.1616 1.6198 5.3422 2.1908 4.6742 1.5859 3.7319 1.3656 1.6030 1.1507 3.4723 1.3883 2.8916 1.4026 1.4710 1.7747 1.3566 6.7916 2.1245 1.5196 2.0789 2.5013 2.0200 1.1527 1.7086 1.2267 1.5899 1.7919 1.9650 1.9173 1.7334 1.8333 1.3765 1.6101 2.3389 1.7194 1.1923 3.9888 4.5631 1.2411 1.1724 3.1570 3.2734 2.6841 1.0440 1.0499 1.0570 2.8443 1.1394 2.2797 6.8359 6.5131 4.8017 7.0726 6.7748 1.0827 1.0346 1.0610 1.0365 1.0992 1.1009 1.1000 1.1007 1.0999 1.0882 1.0852 1.0895 1.0947 1.0957 1.1003 1.0936 1.0762
irintensity: 0.3541 1.4733 3.4518 1.7032 2.8807 0.3092 0.0149 1.5668 1.6915 0.4475 10.3215 2.3136 1.5909 8.3640 6.7387 0.0096 4.2120 13.1385 0.0545 0.5973 0.3959 0.9890 0.1199 6.0705 2.3470 2.0428 46.8596 3.0599 0.2634 5.3263 0.9342 58.4777 0.3965 55.8959 1.2929 41.9219 2.9630 0.1461 4.3373 6.5294 29.4649 2.3766 2.9856 1.3459 0.3088 23.2838 1.6722 4.0480 5.2256 18.3523 3.1828 0.4138 16.8331 0.0067 50.1794 4.6783 34.2499 13.7204 43.6687 9.2989 15.5778 8.5586 0.1906 28.3118 16.0944 11.0664 15.3876 49.4549 31.5109 40.4125 20.5103 28.5581 191.7783 19.3313 4.8719 3.3838 22.0619 162.1085 85.1470 194.1012 5.0772 78.3753 75.4188 9.4536 32.0543 37.8002 36.0350 11.1950 34.7417 6.8121 20.3496 64.7165 3.4298 37.9365 24.9978 3.6448 2.7810 21.1472 28.0994 44.2307 5.5555 11.7850
temp: 298.150 k
press: 1.00000 atm
elementType: 8 7 6 6 6 6 6 6 6 6 6 6 6 6 6 6 6 6 6 1 1 1 1 1 1 1 1 1 1 1 1 1 1 1 1 1
symmnumber: 1
zpe: 772189.9 jmol-1
zpe.correction: 0.294112 hartree
zpe.thermalcorrener: 0.310816 hartree
zpe.thermalcorrenthalpy: 0.311760 hartree
zpe.thermalcorrgfe: 0.248753 hartree
zpe.sumelectzpe: -786.682501 hartree
zpe.sumelectthermal: -786.665797 hartree
zpe.sumelectthermalent: -786.664852 hartree
zpe.sumelectthermalfe: -786.727859 hartree
dipole: -1.0266 2.8409 0.0283
dipole: 3.0208
quadrupole: -95.4428 -102.3708 -117.3729
quadrupole: -12.3632 -0.1069 -0.0247
quadrupole: 9.6194 2.6914 -12.3108 -12.3632 -0.1069 -0.0247
hfenergy: -786.9766125 hartree
pointgroup: C01 [X(C17H17N1O1)]
dipole: 0.4030316 1.0995571 0.202622 debye
polarizability: 353.5030675|3.6889877|185.1094125|-3.3672824|17.1963641|102.2316872 unknown
InChI: InChI=1S/C17H17NO/c1-11(2)17(19)18-14-7-8-16-13(10-14)9-12-5-3-4-6-15(12)16/h3-8,10-11,18H,9H2,1-2H3
charge 0 multiplicity 1
36 atoms
O  3.432163 -1.444414 -0.352811
N  2.785238 0.771413 0.086619
C  -0.736433 -0.516687 -0.113944
C  -1.705626 -1.673549 -0.329945
C  -1.465484 0.684932 0.138512
C  -3.070378 -1.010965 -0.174928
C  -2.907374 0.382416 0.101437
C  0.666039 -0.53789 -0.140702
C  -0.768549 1.89197 0.368653
C  1.362153 0.68192 0.092395
C  -4.354685 -1.574285 -0.266312
C  -4.035639 1.21281 0.286772
C  0.639758 1.884113 0.34437
C  5.197514 0.23631 -0.06117
C  -5.486824 -0.740315 -0.08013
C  -5.326051 0.641089 0.194019
C  3.73114 -0.233297 -0.124325
C  5.926207 -0.517199 1.080901
C  5.878594 -0.034347 -1.427174
H  -1.550416 -2.482882 0.410223
H  -1.578723 -2.134337 -1.329218
H  1.235099 -1.449694 -0.331924
H  -1.304847 2.826886 0.564201
H  -4.486231 -2.641891 -0.477889
H  -3.920092 2.281891 0.499175
H  1.190481 2.817275 0.521937
H  5.236043 1.326148 0.147691
H  3.163273 1.705461 0.26182
H  -6.494354 -1.165839 -0.148384
H  -6.211824 1.27079 0.335339
H  5.477718 -0.298264 2.067024
H  6.992414 -0.228405 1.112254
H  5.860224 -1.605519 0.90794
H  6.944926 0.252874 -1.387945
H  5.395845 0.532169 -2.244216
H  5.811002 -1.109387 -1.668661
