program: Gaussian 09
title: 000148885
version: EM64L-G09RevD.01
frameworkgroup: C1[X(C10H24N2O6S2)]
method: RPBEPBE
basis: SDD
operation: Freq
keyword: #p
keyword: freq=noraman
keyword: PBEPBE/SDD
title: #p freq=noraman PBEPBE/SDD
converged: NO YES NO NO
title: Mulliken charges:
elementType: S S O O O O O O N N C C C C C C C C C C H H H H H H H H H H H H H H H H H H H H H H H H
charge: 1.159992 1.159985 -0.412347 -0.412355 -0.502065 -0.502339 -0.502180 -0.502191 -0.737684 -0.737599 -0.383620 -0.383591 -0.377058 -0.377067 -0.380176 -0.380046 -0.382368 -0.382413 -0.279332 -0.279281 0.196446 0.196474 0.196475 0.196426 0.197629 0.197643 0.197650 0.197582 0.198497 0.198533 0.198440 0.198497 0.218594 0.218715 0.218647 0.218623 0.228771 0.228751 0.228828 0.228636 0.358476 0.358478 0.358514 0.358405
chargesum: 0.00000
title: Mulliken charges with hydrogens summed into heavy atoms:
elementType: S S O O O O O O N N C C C C C C C C C C
charge: 1.159992 1.159985 -0.412347 -0.412355 -0.502065 -0.502339 -0.502180 -0.502191 -0.020729 -0.020680 0.009300 0.009311 0.018215 0.018165 0.016854 0.016892 0.054942 0.054856 0.178190 0.178183
polarizability: 3.10837533e+02 7.51881834e+00 1.66515036e+02 -2.66041620e-02 5.22496591e-02 1.66630223e+02
1716.lowfreq: -2.3922 0.0008 0.0014 0.0022 2.0321 2.3808 3.8151 5.2418 13.6812
frequency: 3.5120 5.1253 12.6098 14.7818 27.4721 43.5312 48.8781 62.7537 70.3190 78.9360 90.8481 95.9073 97.8748 125.6384 128.4849 131.0108 155.9046 158.2287 160.9988 181.6113 182.1989 190.9546 219.2043 267.9427 269.8884 299.0556 299.1104 316.9922 329.9816 343.7724 343.7964 351.1361 360.7840 378.6359 394.9987 446.8278 450.8480 485.5208 493.8368 576.4122 580.8242 723.1869 723.3233 726.9652 733.4444 748.9337 773.5257 808.4107 855.7336 866.1374 866.3521 904.8687 905.8681 914.5163 930.2772 930.6054 975.6608 988.2095 989.1822 1026.7768 1031.9613 1032.4909 1065.4715 1069.4568 1079.5456 1080.7665 1090.3240 1090.4271 1101.6596 1146.5464 1149.5892 1194.9954 1208.9182 1224.0602 1244.0520 1253.1605 1272.5780 1274.6501 1277.7182 1288.4699 1289.1355 1301.1461 1302.0169 1303.6394 1330.2213 1349.4154 1355.3855 1357.1702 1359.8806 1361.0137 1463.0937 1463.2498 1467.3478 1467.9085 1469.8826 1475.1115 1481.0396 1486.1255 1490.8000 1492.4391 1536.6271 1536.6874 2953.7852 2955.1656 2958.6527 2961.8292 2967.5337 2970.8513 2980.6680 2980.8256 2988.6066 2995.8979 2999.3596 2999.5068 3004.7121 3016.6765 3030.5456 3039.8319 3043.4339 3046.6533 3073.2915 3073.6389 3469.1935 3469.3130 3649.1450 3649.2799
redmass: 6.6682 9.0100 7.8730 6.0573 6.4249 5.6226 3.2159 2.2527 1.9790 5.2272 11.4079 2.5269 1.8526 3.8382 1.8912 2.2767 1.9904 2.0463 4.5073 1.6090 1.6298 3.7223 3.2899 4.0041 3.5162 4.0584 4.0556 4.6382 3.6547 2.6352 2.6343 3.5039 4.6328 5.0051 4.5183 5.6293 3.9737 4.3416 3.3247 10.3732 8.3738 4.1605 4.1697 1.0619 1.0772 1.0945 1.1180 1.1598 1.2065 10.6685 10.6624 9.0198 9.2865 1.2373 3.0101 2.9337 1.1893 5.1226 5.3602 1.0971 4.0710 4.1061 2.7898 3.3647 2.4184 2.1747 1.8065 1.8061 4.7099 1.3956 1.2892 1.5988 1.2345 1.4078 1.2775 1.2968 1.1670 1.2782 1.0578 1.1054 1.0802 1.0995 1.1165 1.2919 1.3288 1.4016 1.5788 1.5557 1.3597 1.4462 1.0704 1.0750 1.0680 1.0697 1.0784 1.0914 1.0927 1.0937 1.0947 1.0976 1.0864 1.0864 1.0587 1.0587 1.0591 1.0591 1.0591 1.0585 1.0549 1.0549 1.0968 1.0987 1.0581 1.0581 1.1011 1.1034 1.1044 1.1054 1.1075 1.1067 1.1076 1.1075 1.0404 1.0404 1.1062 1.1062
irintensity: 4.3389 4.9525 0.0026 1.7467 0.0001 0.0001 0.0018 0.0028 1.0990 23.7900 0.0006 0.0741 0.0013 0.0022 0.0127 0.0002 0.0266 2.7200 45.1189 0.2354 41.5097 24.1995 0.0000 0.0046 83.1857 0.4796 1.1701 0.0148 106.6655 0.4288 41.9022 0.0007 90.1449 189.3209 0.0022 0.0103 105.3953 271.2260 0.0016 0.0100 293.8603 70.5852 0.2444 14.4222 0.0004 7.3368 0.0004 1.5661 0.0177 304.2281 0.0378 120.4527 2.9456 1.5996 1.2595 84.6444 0.0000 0.0001 6.2711 0.0446 18.3949 0.0091 0.0001 6.3919 3.0679 0.0013 31.1824 95.7349 0.0000 0.0005 1.3426 0.0034 63.2685 0.0019 0.0000 0.0007 0.7702 5.0324 0.0003 0.0865 0.0001 0.1302 0.0002 0.0000 0.3917 0.0001 0.0038 7.8253 9.4395 0.0056 0.0001 0.0236 0.0054 6.5240 0.0005 9.4142 0.0002 13.3968 0.0191 46.1360 25.7268 28.9186 0.0001 0.3997 0.0006 3.3678 0.0855 156.7457 32.8226 33.6287 0.0015 0.2050 16.9382 74.3352 0.0035 1.9568 0.0040 53.2380 0.1411 81.8559 15.5725 152.0238 89.6217 52.6075 50.9936 56.5017
temp: 298.150 k
press: 1.00000 atm
elementType: 16 16 8 8 8 8 8 8 7 7 6 6 6 6 6 6 6 6 6 6 1 1 1 1 1 1 1 1 1 1 1 1 1 1 1 1 1 1 1 1 1 1 1 1
symmnumber: 1
zpe: 922701.8 jmol-1
zpe.correction: 0.351439 hartree
zpe.thermalcorrener: 0.379176 hartree
zpe.thermalcorrenthalpy: 0.380120 hartree
zpe.thermalcorrgfe: 0.283858 hartree
zpe.sumelectzpe: -1750.380150 hartree
zpe.sumelectthermal: -1750.352412 hartree
zpe.sumelectthermalent: -1750.351468 hartree
zpe.sumelectthermalfe: -1750.447730 hartree
dipole: -0.0008 -0.0019 -0.0907
dipole: 0.0907
quadrupole: -208.4417 -132.6916 -144.3186
quadrupole: 69.8139 -0.6235 -0.1203
quadrupole: -46.6244 29.1257 17.4987 69.8139 -0.6235 -0.1203
hfenergy: -1750.7315884 hartree
pointgroup: C01 [X(C10H24N2O6S2)]
dipole: -0.0003251 0.0009732 0.0356723 debye
polarizability: 310.82289|-7.6576597|166.530355|0.0820698|0.0525698|166.6295471 unknown
InChI: InChI=1S/C10H24N2O6S2/c11-19(13,14)17-9-7-5-3-1-2-4-6-8-10-18-20(12,15)16/h1-12H2
charge 0 multiplicity 1
44 atoms
S  8.585819 0.150861 -0.025329
S  -8.591123 -0.159056 -0.021037
O  6.896502 -0.648361 0.000066
O  -6.902102 0.641056 -0.017172
O  8.80308 0.86017 -1.45462
O  8.813248 0.931459 1.364788
O  -8.806238 -0.910515 -1.42901
O  -8.820235 -0.898128 1.391247
N  9.557815 -1.310525 0.008237
N  -9.56356 1.30243 -0.031613
C  0.649597 0.411697 -0.012032
C  -0.654515 -0.417509 -0.010035
C  1.924189 -0.462047 -0.006294
C  -1.929233 0.456074 -0.011457
C  3.226715 0.369946 -0.014518
C  -3.231781 -0.375889 -0.011316
C  4.494705 -0.51925 -0.007037
C  -4.500094 0.512735 -0.014792
C  5.773509 0.329797 -0.016245
C  -5.778773 -0.33663 -0.012757
H  0.662014 1.073418 -0.903213
H  0.65952 1.081437 0.873184
H  -0.665893 -1.084962 -0.896939
H  -0.665376 -1.08156 0.879458
H  1.914442 -1.119724 0.887595
H  1.912498 -1.134406 -0.88916
H  -1.918922 1.121956 0.876339
H  -1.918032 1.120407 -0.900403
H  3.238043 1.041584 0.868495
H  3.237024 1.025517 -0.909521
H  -3.243536 -1.037773 0.879064
H  -3.241427 -1.041496 -0.898921
H  4.496001 -1.166403 0.890511
H  4.494806 -1.183873 -0.891656
H  -4.501508 1.1716 0.874181
H  -4.500604 1.165874 -0.907973
H  5.831176 0.975425 0.881338
H  5.834595 0.949867 -0.931538
H  -5.83714 -0.972883 -0.917043
H  -5.838589 -0.966397 0.895946
H  9.545563 -1.807357 0.903552
H  9.536008 -1.854373 -0.859128
H  -9.552491 1.82516 0.848856
H  -9.540498 1.820846 -0.914398
