program: Gaussian 09
title: 000148926
version: EM64L-G09RevD.01
frameworkgroup: C1[X(C32H23BrO4)]
method: RPBEPBE
basis: SDD
operation: Freq
keyword: #p
keyword: freq=noraman
keyword: PBEPBE/SDD
title: #p freq=noraman PBEPBE/SDD
converged: YES YES NO NO
title: Mulliken charges:
elementType: Br O O O O C C C C C C C C C C C C C C C C C C C C C C C C C C C C C C C C H H H H H H H H H H H H H H H H H H H H H H H
charge: -0.047485 -0.305598 -0.297451 -0.246282 -0.257725 -0.108509 -0.306895 -0.457998 0.402761 -0.621988 0.349338 -0.691112 -0.515248 0.228076 0.464094 0.196530 -0.498460 0.422950 -0.473025 0.212288 0.228252 -0.364879 -0.433676 -0.260977 0.209407 0.219138 -0.247350 -0.337619 -0.332998 -0.337326 -0.330516 -0.221106 -0.218191 -0.220870 -0.219215 -0.219842 -0.220476 0.284600 0.328898 0.248514 0.265108 0.314542 0.287142 0.242307 0.249694 0.237303 0.229217 0.241019 0.230170 0.230638 0.270986 0.262739 0.269381 0.261881 0.235737 0.233680 0.234554 0.233568 0.234550 0.233755
chargesum: 0.00000
title: Mulliken charges with hydrogens summed into heavy atoms:
elementType: Br O O O O C C C C C C C C C C C C C C C C C C C C C C C C C C C C C C C C
charge: -0.047485 -0.305598 -0.297451 -0.246282 -0.257725 0.176091 0.022004 0.055624 0.402761 -0.307446 0.349338 -0.403970 -0.272940 0.228076 0.464094 0.196530 -0.248765 0.422950 -0.235722 0.212288 0.228252 -0.135663 -0.192656 -0.030807 0.209407 0.219138 -0.016712 -0.066634 -0.070259 -0.067945 -0.068636 0.014631 0.015488 0.013683 0.014353 0.014708 0.013279
polarizability: 4.78148388e+02 2.43478535e+01 3.61344562e+02 -1.18886724e+00 -6.50116490e+00 3.62825011e+02
1716.lowfreq: -3.9704 -2.5564 -0.0006 -0.0004 0.0001 1.4474 11.1589 15.4208 21.0325
frequency: 11.0895 15.4165 21.0129 25.6231 26.8680 30.7818 36.3606 56.8571 64.3329 65.7645 84.5607 89.8941 111.8666 137.0332 139.8443 146.2666 156.3254 173.2386 184.4978 202.3899 221.1842 235.6414 259.6010 262.0697 284.1086 315.5615 329.0572 362.5901 365.0052 399.0120 403.3161 403.6413 405.4865 420.2253 433.0450 437.9461 444.9212 457.7813 480.1243 488.9259 507.2309 533.7354 541.7275 556.1612 567.6847 597.3314 608.1465 614.0200 614.3277 638.0363 659.8986 664.7047 677.7374 680.0701 696.6317 700.2881 700.9222 718.6573 748.3708 749.5644 759.9790 764.9532 768.8220 794.5974 795.5280 806.0135 811.3128 836.0048 845.6753 863.5961 864.0760 866.8262 879.7620 888.6798 893.0572 914.8587 935.4583 940.0652 950.4871 954.0104 954.6470 960.8410 986.8123 990.4332 990.7410 994.9178 995.3484 995.5429 1006.7507 1008.9871 1009.6892 1014.5353 1017.2313 1023.0442 1041.1204 1042.3287 1047.3083 1086.7013 1087.4957 1105.2029 1121.9641 1146.1108 1155.7362 1168.0694 1174.7944 1175.1153 1178.7092 1181.3367 1183.5715 1191.9042 1214.8266 1229.9667 1234.9043 1236.3052 1240.0167 1264.5029 1279.6466 1289.3450 1298.8701 1305.8412 1313.2246 1315.7836 1316.7084 1338.1198 1347.8124 1362.2327 1385.9703 1390.1779 1390.7123 1400.9591 1408.4030 1428.8426 1438.2511 1438.8233 1450.6178 1451.5623 1461.8206 1477.6645 1478.1944 1506.1280 1519.8432 1570.1807 1584.1478 1584.9187 1608.0546 1610.8994 1611.7501 1618.4875 1624.2746 1626.3753 1629.3565 3031.5429 3058.4897 3063.0057 3068.5765 3097.7445 3121.7612 3123.3364 3131.6528 3132.7414 3133.0480 3134.2684 3144.4809 3145.0424 3146.7039 3147.6930 3155.0316 3156.8384 3156.9662 3166.3589 3168.2820 3168.6657 3179.8301 3180.3470
redmass: 8.5043 6.3842 5.9664 7.3129 4.9234 4.3220 5.4750 6.6149 6.6454 8.5153 7.0875 7.5118 5.7232 5.7609 5.7324 5.9980 7.9958 5.4359 6.3849 5.2382 6.3299 6.1891 3.7874 7.4774 4.9757 6.4431 4.9241 5.7321 4.3887 3.3568 2.8795 2.8225 5.1563 5.8590 3.2826 4.0191 4.1830 4.6140 5.9955 5.2885 5.2810 3.6223 4.1865 4.5129 4.5766 5.8487 6.1890 6.4357 6.4453 6.4441 6.7882 6.7855 5.1097 5.1612 3.7821 1.6301 1.6169 5.8298 5.6384 3.5674 1.3215 4.6019 6.2297 2.1661 2.1747 2.3055 5.0345 1.5731 4.0054 1.2457 1.2471 4.2937 6.2840 1.7305 4.5728 1.7944 2.2656 1.7400 3.4858 1.4183 1.4202 1.4074 1.3790 6.1988 6.1726 1.3887 1.3930 1.3889 2.5189 1.3310 1.3326 3.9350 3.6296 3.2948 2.1986 2.5871 2.7520 1.6293 1.6637 2.1196 1.4411 1.5455 1.3945 1.6751 1.0574 1.0570 1.0855 1.1653 1.1303 1.3409 1.6416 1.9999 2.3257 2.3807 3.1999 2.0706 1.8807 1.6667 1.8169 1.3973 1.4538 1.3182 1.3097 1.3847 1.8729 1.5941 3.5645 9.9980 9.9626 3.5910 3.1236 2.9635 2.2432 2.2498 3.0900 1.1637 2.7414 2.2728 2.2896 3.5798 4.2032 7.4547 6.8457 6.6907 6.0403 6.1493 6.1235 9.9415 10.2088 6.6879 7.0928 1.0610 1.0847 1.0871 1.0873 1.1019 1.0867 1.0862 1.0856 1.0856 1.0922 1.0885 1.0892 1.0891 1.0967 1.0951 1.0909 1.0939 1.0939 1.0992 1.0977 1.0980 1.0978 1.0979
irintensity: 0.1801 0.2990 1.3676 0.2318 0.0465 0.4681 0.0528 0.2341 1.9669 1.1415 0.1469 1.6749 0.8333 0.0735 0.4915 0.6441 0.2100 0.4769 1.9050 3.0596 6.8318 1.5238 3.6571 13.7956 3.3198 15.0109 7.9967 11.5445 2.3405 4.1563 0.3913 0.0264 7.1912 8.2618 7.3447 2.8051 2.7606 6.8774 8.4594 5.3758 0.8195 0.9244 3.8305 6.9609 0.9113 37.0494 9.3418 1.3234 0.7098 5.1902 5.2162 7.1775 15.0189 13.7636 8.8390 55.1120 120.7633 3.1680 10.6549 9.7790 59.5067 14.1563 6.8425 23.7646 21.9950 1.3700 10.0803 36.0980 1.5468 0.3830 0.1262 1.7946 157.3198 13.8777 14.6222 19.2493 8.3565 10.9936 15.9735 3.3098 4.3033 5.6647 0.5854 8.5057 1.6944 0.6253 0.5456 0.1691 15.7047 0.3115 0.2881 366.3544 142.1635 20.5276 6.7120 291.6368 187.8070 34.1616 5.4057 7.8323 60.0143 3.4354 7.6554 22.7901 0.4846 0.2057 2.9070 106.0604 32.3080 17.2869 34.3466 2.4249 226.6921 264.7304 192.8744 72.8518 3.9562 15.3336 22.3708 20.1329 5.2949 2.0164 0.8552 2.9092 23.6654 18.8454 2.2896 2.6577 2.4754 12.5887 2.6055 3.5898 17.5479 18.4001 3.3279 7.5938 6.0629 4.1574 7.2603 15.1702 1.2868 2.4742 42.9014 26.3496 0.9953 12.9248 9.3558 147.1418 133.0537 8.2990 8.1846 7.7483 17.3025 4.4152 4.4138 17.1544 0.4099 4.1733 0.3170 0.2724 0.6119 4.6156 9.2438 8.6608 9.4757 31.8136 17.9176 17.8925 12.3168 33.8528 24.4404 23.5947 9.2978 7.7847
temp: 298.150 k
press: 1.00000 atm
elementType: 35 8 8 8 8 6 6 6 6 6 6 6 6 6 6 6 6 6 6 6 6 6 6 6 6 6 6 6 6 6 6 6 6 6 6 6 6 1 1 1 1 1 1 1 1 1 1 1 1 1 1 1 1 1 1 1 1 1 1 1
symmnumber: 1
zpe: 1204832.1 jmol-1
zpe.correction: 0.458896 hartree
zpe.thermalcorrener: 0.489325 hartree
zpe.thermalcorrenthalpy: 0.490269 hartree
zpe.thermalcorrgfe: 0.391950 hartree
zpe.sumelectzpe: -1545.091921 hartree
zpe.sumelectthermal: -1545.061493 hartree
zpe.sumelectthermalent: -1545.060549 hartree
zpe.sumelectthermalfe: -1545.158867 hartree
dipole: -1.5088 0.3663 -0.2552
dipole: 1.5735
quadrupole: -192.3886 -199.3982 -220.4052
quadrupole: -15.6206 6.2173 4.4146
quadrupole: 11.6754 4.6658 -16.3412 -15.6206 6.2173 4.4146
hfenergy: -1545.5508176 hartree
pointgroup: C01 [X(C32H23Br1O4)]
dipole: 0.5864406 -0.1898555 -0.0572387 debye
polarizability: 480.5164742|16.6237509|360.027279|5.0975229|7.4089915|361.7742073 unknown
InChI: InChI=1S/C32H23BrO4/c33-28-19-29(36-31(34)21-10-3-1-4-11-21)30(37-32(35)22-12-5-2-6-13-22)27-17-23-16-15-20-9-7-8-14-24(20)25(23)18-26(27)28/h1-18,28-30H,19H2
charge 0 multiplicity 1
60 atoms
Br 0.4311 1.236076 4.121483
O  -0.66432 -2.516991 1.195474
O  -2.515614 0.558425 0.195624
O  -2.249757 -3.623681 -0.112749
O  -2.691027 0.638629 -2.133461
C  -1.59387 -1.353497 1.296412
C  -1.398483 -0.451719 0.064708
C  -1.23685 -0.602891 2.582356
C  -0.055541 0.251763 0.047841
C  0.225448 -0.132558 2.564984
C  0.712415 0.437728 1.248457
C  0.467264 0.695226 -1.175426
C  1.968477 1.062468 1.164036
C  2.508573 1.539336 -0.062609
C  1.73088 1.3455 -1.262558
C  3.812172 2.205626 -0.153845
C  2.241647 1.801486 -2.535658
C  4.285426 2.641449 -1.445747
C  3.471694 2.423198 -2.622413
C  -1.121615 -3.612672 0.437619
C  -3.075365 1.029139 -1.003262
C  4.642392 2.447779 0.98319
C  5.554706 3.289377 -1.553254
C  5.884398 3.085883 0.856314
C  -0.122994 -4.715611 0.390268
C  -4.157693 2.024624 -0.76025
C  6.348332 3.510597 -0.421542
C  -0.476162 -5.90055 -0.307657
C  1.15019 -4.609284 1.008981
C  -4.862205 2.525228 -1.886594
C  -4.489497 2.479603 0.542699
C  0.436034 -6.972137 -0.382711
C  2.059816 -5.684303 0.929641
C  -5.892877 3.470207 -1.710376
C  -5.520301 3.42724 0.713315
C  1.705056 -6.866084 0.236058
C  -6.223997 3.922594 -0.41037
H  -2.632134 -1.727473 1.311544
H  -1.570532 -1.006876 -0.873077
H  -1.418291 -1.235469 3.46686
H  -1.910693 0.269608 2.642493
H  0.903616 -0.925937 2.916722
H  -0.120539 0.542869 -2.088371
H  2.528493 1.201323 2.09355
H  1.629244 1.642693 -3.43047
H  3.854946 2.767221 -3.590285
H  4.312014 2.137762 1.979294
H  5.898938 3.613578 -2.542626
H  6.500262 3.260629 1.745164
H  7.319462 4.008646 -0.514165
H  -1.46247 -5.957864 -0.779854
H  1.414086 -3.689573 1.537966
H  -4.586881 2.161283 -2.881893
H  -3.936508 2.093928 1.403443
H  0.162545 -7.885977 -0.920683
H  3.043262 -5.60266 1.404696
H  -6.436678 3.854263 -2.579989
H  -5.774411 3.780976 1.718206
H  2.414342 -7.699187 0.176573
H  -7.024622 4.658234 -0.273976
