program: Gaussian 09
title: 000148884
version: EM64L-G09RevD.01
frameworkgroup: C1[X(C2H8N2O6S2)]
method: RPBEPBE
basis: SDD
operation: Freq
keyword: #p
keyword: freq=noraman
keyword: PBEPBE/SDD
title: #p freq=noraman PBEPBE/SDD
converged: NO YES NO NO
title: Mulliken charges:
elementType: S S O O O O O O N N C C H H H H H H H H
charge: 1.176252 1.177146 -0.389640 -0.389385 -0.572909 -0.476890 -0.573464 -0.476490 -0.733961 -0.733904 -0.277224 -0.276765 0.242916 0.266430 0.242755 0.266171 0.358829 0.405464 0.359257 0.405411
chargesum: 0.00000
title: Mulliken charges with hydrogens summed into heavy atoms:
elementType: S S O O O O O O N N C C
charge: 1.176252 1.177146 -0.389640 -0.389385 -0.572909 -0.476890 -0.573464 -0.476490 0.030332 0.030763 0.232122 0.232162
polarizability: 1.32861219e+02 -8.36928371e-03 1.12734402e+02 4.83245190e+00 -2.28358019e-03 8.54870245e+01
1716.lowfreq: -9.9363 -0.8772 -0.0024 -0.0023 0.0016 11.7209 74.3565 80.6039 85.7330
frequency: 74.3084 80.5958 85.6192 119.2122 129.8303 175.3059 179.4944 187.9283 211.4776 259.5410 263.5279 277.5125 298.6553 333.0101 340.3247 353.1908 354.4213 368.1043 405.8513 414.6934 422.5890 497.7628 509.2455 586.8850 645.8199 772.4140 772.9071 789.0980 850.5279 876.8566 893.7618 945.4688 948.6355 979.7302 985.8023 1062.0627 1148.5080 1164.6765 1211.5827 1254.0609 1334.0061 1347.3185 1413.9272 1415.3825 1537.1984 1544.2650 2992.9380 2998.3162 3064.0706 3064.5326 3185.7449 3210.2543 3559.0345 3559.4676
redmass: 5.9977 7.3552 8.8629 14.3551 8.7577 6.0142 3.8517 9.3447 9.0720 3.6900 3.6529 2.6945 2.6057 6.3905 3.9615 5.6277 2.3395 1.9343 2.9518 4.6729 3.9344 5.9118 6.5860 2.1303 2.5602 2.8089 3.0423 3.3608 4.1892 2.5512 3.7749 5.1752 5.7617 2.4588 3.3151 3.3049 1.3581 1.3900 1.0811 1.0622 1.2050 1.2412 1.0679 1.0809 1.0740 1.0772 1.0561 1.0594 1.1057 1.1049 1.0597 1.0584 1.0900 1.0902
irintensity: 0.0048 1.7647 0.5437 2.2297 26.2173 19.0663 19.9511 0.1479 1.9485 10.9946 2.9732 34.5219 20.7642 34.3144 0.4023 15.5607 5.0913 125.8152 16.1257 22.0500 0.8503 167.7046 65.5478 11.2624 267.6343 8.8885 20.6260 16.8847 40.2706 128.2611 195.4533 4.2967 179.9189 38.8880 40.5815 0.4206 162.4351 8.3893 9.9058 0.1073 3.6343 15.4386 19.1083 26.2452 135.0321 4.0747 3.9460 21.1080 3.2901 2.0230 4.2894 741.3687 135.3415 154.1383
temp: 298.150 k
press: 1.00000 atm
elementType: 16 16 8 8 8 8 8 8 7 7 6 6 1 1 1 1 1 1 1 1
symmnumber: 1
zpe: 337690.6 jmol-1
zpe.correction: 0.128620 hartree
zpe.thermalcorrener: 0.143464 hartree
zpe.thermalcorrenthalpy: 0.144408 hartree
zpe.thermalcorrgfe: 0.087741 hartree
zpe.sumelectzpe: -1436.607386 hartree
zpe.sumelectthermal: -1436.592542 hartree
zpe.sumelectthermalent: -1436.591597 hartree
zpe.sumelectthermalfe: -1436.648264 hartree
dipole: 0.0202 1.8820 0.0060
dipole: 1.8821
quadrupole: -107.4058 -78.5954 -82.3323
quadrupole: -0.0554 11.1108 -0.0181
quadrupole: -17.9613 10.8491 7.1122 -0.0554 11.1108 -0.0181
hfenergy: -1436.7360052 hartree
pointgroup: C01 [X(C2H8N2O6S2)]
dipole: -0.0094501 0.7404184 -0.0015498 debye
dipolederiv: 1.6585246 -0.1434765 -0.0444608 -0.2870872 1.7635137 -0.0653867 -0.1158542 -0.0405436 1.503563 1.6587637 0.1456063 -0.0428964 0.2884464 1.7656421 0.0663963 -0.1123608 0.041459 1.5045313 -0.659879 0.2984824 0.0321657 0.302396 -0.8058413 -0.0237978 -0.0344113 0.012168 -0.3960809 -0.6587146 -0.2999278 0.0308564 -0.302593 -0.8057909 0.0239151 -0.0345421 -0.0136682 -0.3951023 -0.8358645 -0.057166 -0.1636956 -0.0755806 -0.5473578 -0.0884911 -0.0878839 -0.1106586 -0.5791215 -0.7403028 0.0597867 0.0837461 0.0897386 -0.4672283 -0.0133618 -0.0117562 0.0102665 -0.4460615 -0.8396096 0.0569751 -0.165308 0.0759783 -0.5486214 0.0884451 -0.0892872 0.1107147 -0.5791224 -0.740781 -0.059737 0.0839338 -0.0896546 -0.4671987 0.0131825 -0.0126734 -0.0100421 -0.4457794 -0.6962232 0.0169126 0.050392 0.1270825 -0.8255977 0.0710379 0.1249429 0.1736326 -0.6896866 -0.6913974 -0.0189249 0.0501434 -0.1278852 -0.8273887 -0.0715146 0.1217292 -0.1740558 -0.6903996 0.4207064 -0.360834 -0.0133461 -0.2181039 0.2407547 0.0381604 0.1332058 -0.2229678 0.1094119 0.4182062 0.3610349 -0.0130511 0.2174081 0.2446144 -0.0383757 0.1346653 0.2239474 0.1092516 -0.0486514 0.0139536 -0.0126503 -0.0186275 -0.1180694 0.0116054 -0.0107411 0.0031428 0.1214953 0.056724 0.0743309 -0.009544 0.0267063 0.1262339 -0.0704557 -0.0111924 0.0059757 -0.0084191 -0.0492524 -0.0133457 -0.0125947 0.0191968 -0.1189041 -0.0120508 -0.0108256 -0.0035306 0.1212242 0.0568952 -0.0744614 -0.0097199 -0.0270597 0.1254428 0.0708032 -0.0113275 -0.0056682 -0.0084797 0.1561915 -0.1102354 0.0587795 -0.0946022 0.3336811 0.0113091 0.0125791 0.0237935 0.2118009 0.6939021 0.033633 0.0197386 -0.1375143 0.2983583 0.0131775 0.001507 0.0488922 0.1723245 0.1584547 0.1112485 0.0596036 0.095141 0.333302 -0.0118779 0.0128423 -0.0239092 0.2122222 0.6823075 -0.0338554 0.0179079 0.1366141 0.3004554 -0.0127202 0.0013842 -0.048948 0.1724281 unknown
polarizability: 133.3338788|0.0455088|112.7344971|0.8559219|0.0085787|85.0142695 unknown
InChI: InChI=1S/C2H8N2O6S2/c3-11(5,6)9-1-2-10-12(4,7)8/h1-4H2
charge 0 multiplicity 1
20 atoms
S  2.038349 -0.725775 -0.28311
S  -2.038301 -0.730363 0.283094
O  1.628029 0.949876 0.476799
O  -1.623865 0.944368 -0.476971
O  0.939774 -0.976092 -1.45287
O  3.609386 -0.786635 -0.598941
O  -0.939049 -0.985435 1.451244
O  -3.609028 -0.787318 0.601327
N  1.692179 -1.808742 1.038136
N  -1.697546 -1.813744 -1.039214
C  0.712217 1.823254 -0.289562
C  -0.710323 1.819468 0.290393
H  1.166946 2.828104 -0.197619
H  0.686511 1.539974 -1.359152
H  -1.16848 2.822814 0.199981
H  -0.683548 1.534922 1.359662
H  2.466265 -1.893752 1.706551
H  0.715346 -1.688498 1.384406
H  -2.472618 -1.895931 -1.706813
H  -0.719945 -1.699196 -1.385441
