program: Gaussian 09
title: 000148862
version: EM64L-G09RevD.01
frameworkgroup: C1[X(C13H11Cl2NO2)]
method: RPBEPBE
basis: SDD
operation: Freq
keyword: #p
keyword: freq=noraman
keyword: PBEPBE/SDD
title: #p freq=noraman PBEPBE/SDD
converged: YES YES NO NO
title: Mulliken charges:
elementType: Cl Cl O O N C C C C C C C C C C C C C H H H H H H H H H H H
charge: -0.021721 -0.058456 -0.287350 -0.304657 -0.684339 0.329365 0.225239 0.314185 -0.482911 -0.370868 0.439125 -0.357066 -0.285485 -0.302119 -0.198754 -0.219664 -0.105079 -0.529515 0.267713 0.257512 0.225288 0.275209 0.279600 0.256058 0.337693 0.304139 0.225387 0.228925 0.242545
chargesum: 0.00000
title: Mulliken charges with hydrogens summed into heavy atoms:
elementType: Cl Cl O O N C C C C C C C C C C C C C
charge: -0.021721 -0.058456 -0.287350 -0.304657 -0.042507 0.329365 0.225239 0.314185 -0.215198 -0.113356 0.439125 -0.131778 -0.285485 -0.026910 0.080846 0.036394 -0.105079 0.167342
polarizability: 2.58231871e+02 -6.50604769e+00 1.55558960e+02 -3.07378513e+00 4.76582426e+00 1.30355948e+02
1716.lowfreq: -6.0459 -4.6918 0.0015 0.0024 0.0024 1.5618 8.3894 27.0438 45.1126
frequency: 6.7951 27.0168 45.1018 93.5171 95.2146 138.8165 149.2775 164.1385 190.0485 194.8053 215.5971 267.5791 288.1300 319.4589 322.9539 353.4409 370.9788 378.8027 406.5191 420.6307 437.9311 444.6167 481.1244 507.8502 523.5078 543.3778 555.4486 607.6336 639.7301 683.2620 694.2958 719.9155 724.5252 782.2894 799.9454 809.1356 824.2952 847.8830 859.9110 916.0133 917.0688 936.2044 1002.3977 1022.7990 1025.7821 1080.3405 1116.8314 1118.3312 1139.0794 1142.6913 1162.1731 1209.7282 1225.2961 1244.2015 1268.0463 1325.7220 1359.2754 1387.2526 1400.0537 1425.7463 1445.0652 1452.7133 1466.5488 1475.7909 1517.1238 1571.2525 1590.8556 1598.3375 1603.7799 1633.7088 2963.9213 3052.9214 3126.5216 3134.4253 3159.3301 3167.5612 3175.4004 3178.5213 3182.4467 3566.2126 3714.0017
redmass: 5.8981 6.3961 6.7355 4.0683 4.9307 8.2667 8.2754 5.9782 2.5808 3.8850 3.3264 1.9419 4.4809 4.4678 3.6886 1.4893 7.1537 5.3695 8.2210 7.8930 3.2670 2.6963 1.1211 5.6639 3.5566 4.3308 5.3869 6.7192 6.2829 5.4364 4.3106 5.4532 4.2631 5.2343 1.5385 1.4421 5.4116 1.5387 1.3821 3.9218 1.4979 1.3334 4.9407 1.5971 3.9402 2.4427 1.2730 1.9506 1.2692 1.2962 1.4046 4.1164 4.2787 1.3462 1.4499 3.0653 4.8361 5.7882 4.1505 3.0710 1.5228 2.4197 1.0490 1.0734 3.5582 8.0713 6.0673 7.2280 1.7060 2.7577 1.0327 1.1041 1.1000 1.0891 1.0882 1.0955 1.0919 1.0963 1.0937 1.0443 1.1046
irintensity: 0.1738 0.0633 0.1226 4.8193 3.0543 1.5393 2.7719 0.1423 0.0807 4.8990 2.1874 0.9287 0.9709 17.4603 20.4170 158.6266 14.2633 4.5697 5.9103 5.2606 6.2213 11.7207 82.1067 5.7377 5.5572 5.6696 14.2460 23.4388 6.2398 8.0277 4.7288 19.3073 6.7176 29.2854 43.7807 36.1692 12.6416 40.7816 22.0807 51.0420 11.2595 0.0400 60.5461 1.6680 106.7373 47.6821 2.7114 90.7515 16.8842 16.8780 14.8400 155.2577 208.5336 18.9551 16.3561 39.1179 15.4191 5.0782 5.1804 10.9505 135.2155 248.7883 14.2162 43.0362 310.6417 29.7837 12.2101 26.6600 40.3021 192.4157 56.0544 42.5741 23.4391 21.3908 1.0146 4.6192 0.8935 0.8635 0.3746 105.0426 36.0847
temp: 298.150 k
press: 1.00000 atm
elementType: 17 17 8 8 7 6 6 6 6 6 6 6 6 6 6 6 6 6 1 1 1 1 1 1 1 1 1 1 1
symmnumber: 1
zpe: 551101.5 jmol-1
zpe.correction: 0.209903 hartree
zpe.thermalcorrener: 0.227093 hartree
zpe.thermalcorrenthalpy: 0.228037 hartree
zpe.thermalcorrgfe: 0.162097 hartree
zpe.sumelectzpe: -1625.989435 hartree
zpe.sumelectthermal: -1625.972246 hartree
zpe.sumelectthermalent: -1625.971301 hartree
zpe.sumelectthermalfe: -1626.037241 hartree
dipole: 5.1434 -2.1394 0.8323
dipole: 5.6325
quadrupole: -106.8325 -122.3444 -106.3321
quadrupole: -7.5005 2.2657 5.8283
quadrupole: 5.0038 -10.5080 5.5042 -7.5005 2.2657 5.8283
hfenergy: -1626.1993381 hartree
pointgroup: C01 [X(C13H11Cl2N1O2)]
dipole: -1.9446618 -0.8725164 0.6063187 debye
polarizability: 255.9564143|18.5309318|132.6436438|-1.7424436|-3.7599461|155.5467208 unknown
InChI: InChI=1S/C13H11Cl2NO2/c1-17-13-7-9(3-4-11(13)16)18-12-5-2-8(14)6-10(12)15/h2-7H,16H2,1H3
charge 0 multiplicity 1
29 atoms
Cl 2.787712 1.418761 -2.574103
Cl 5.573078 -0.216778 1.948608
O  0.376976 0.665984 -1.0019
O  -3.685486 -2.065297 -0.355074
N  -4.746316 -0.199606 1.223718
C  -0.890579 0.446828 -0.366201
C  -2.871214 -0.936487 -0.131941
C  -3.474673 0.04821 0.719837
C  -1.58618 -0.744988 -0.671268
C  -1.45273 1.436501 0.457212
C  1.545844 0.446117 -0.260537
C  -2.742132 1.230385 0.999314
C  2.780574 0.755135 -0.887231
C  1.562607 -0.073271 1.057156
C  4.007426 0.557477 -0.227857
C  2.783889 -0.278877 1.734384
C  3.988881 0.040184 1.082548
C  -3.159876 -3.11099 -1.23362
H  -1.115819 -1.480323 -1.329143
H  -0.898419 2.357161 0.6623
H  -3.190241 1.999147 1.639048
H  0.615803 -0.314646 1.548452
H  4.947825 0.803076 -0.727225
H  2.790893 -0.680526 2.751191
H  -5.214609 -1.064927 0.969258
H  -5.21753 0.476094 1.815981
H  -2.230938 -3.549375 -0.820207
H  -2.964776 -2.7160 -2.249148
H  -3.945587 -3.879372 -1.277253
