program: Gaussian 09
title: 000148853
version: EM64L-G09RevD.01
frameworkgroup: C1[X(C15H20O3)]
method: RPBEPBE
basis: SDD
operation: Freq
keyword: #pfreq=noraman
keyword: PBEPBE/SDD
title: #p freq=noraman PBEPBE/SDD
converged: YES YES NO NO
title: Mulliken charges:
elementType: O O O C C C C C C C C C C C C C C C H H H H H H H H H H H H H H H H H H H H
charge: -0.285992 -0.419121 -0.228489 0.362034 -0.466846 -0.561707 0.364755 0.138869 -0.734126 -0.734905 -0.608771 0.518562 -0.391090 -0.563925 -0.408342 -0.377263 -0.471977 0.171717 0.209264 0.225222 0.226455 0.228840 0.228784 0.232399 0.203320 0.232364 0.242637 0.209803 0.235385 0.245842 0.201146 0.201070 0.232421 0.229984 0.234102 0.251317 0.250834 0.375428
chargesum: 0.00000
title: Mulliken charges with hydrogens summed into heavy atoms:
elementType: O O O C C C C C C C C C C C C C C C
charge: -0.285992 -0.043693 -0.228489 0.362034 -0.032360 -0.106412 0.364755 0.138869 -0.069623 -0.050102 -0.373386 0.518562 -0.145248 -0.161709 -0.175921 0.086824 0.030174 0.171717
polarizability: 2.36498199e+02 1.48000572e+01 1.41489116e+02 1.13965992e+01 -1.01444380e+01 1.37313550e+02
1716.lowfreq: -12.3925 -6.3523 -1.2321 0.0006 0.0007 0.0008 5.0599 16.8637 30.1772
frequency: -4.5628 16.6654 30.0844 65.4406 77.4786 87.6689 116.9170 142.7316 172.8113 189.4801 206.3077 231.2247 255.3213 275.0238 286.7572 314.4354 356.1677 365.9348 425.2457 434.9981 440.7790 446.4423 476.0465 482.8601 501.4568 540.1757 581.2423 605.0747 609.2126 637.8677 709.8627 726.8136 732.2568 742.2230 768.3003 827.7150 844.7203 848.3466 861.8382 884.0184 892.0614 920.3581 932.8251 936.4350 952.9886 986.0944 1010.8718 1023.2900 1034.1780 1048.5445 1053.3690 1084.1562 1115.3040 1119.1247 1136.6991 1153.3520 1157.8372 1202.9642 1231.7806 1233.0065 1239.0471 1252.6730 1257.0682 1259.9542 1271.5790 1278.7847 1285.3053 1330.5564 1335.7867 1348.0018 1369.5857 1377.2019 1383.8101 1393.2508 1426.2974 1438.1348 1446.7039 1456.8991 1463.7512 1467.7334 1468.4267 1473.1145 1483.1570 1485.2718 1494.2884 1587.3350 1625.0361 1670.9970 2968.1309 2970.7552 2985.5386 2987.1129 2990.3253 2996.3733 3006.7034 3017.3999 3028.2406 3031.8823 3057.7704 3071.2684 3083.4722 3091.8743 3093.7019 3096.9092 3098.2297 3121.9434 3160.6481 3513.7374
redmass: 5.7343 6.4645 4.5732 4.4733 2.6626 1.8770 3.8200 3.1976 1.8863 1.9232 1.8201 1.4316 3.3830 2.1986 2.6733 3.0484 2.3480 4.7194 3.8247 2.7582 2.7498 3.1444 3.8507 4.0194 1.8047 4.4299 4.7180 3.8371 3.3602 1.3244 3.8557 3.5214 3.2408 1.2408 3.4496 1.4780 1.5418 3.8147 3.2206 2.0855 1.6478 1.7208 2.2700 1.8843 1.3651 1.3834 3.4566 1.6997 1.7429 2.1940 2.2429 2.5485 1.9446 1.7341 1.3013 1.5310 1.6066 1.6486 1.4689 2.3166 1.7445 1.3276 2.2106 2.2237 1.4908 1.6215 1.1797 1.5313 1.5942 1.5551 1.8456 1.2729 5.7238 1.2174 3.7254 1.0847 1.0700 1.0926 1.0911 1.0960 1.0678 1.1081 1.1084 1.8803 1.2021 6.9867 6.9887 8.2626 1.0593 1.0642 1.0610 1.0361 1.0391 1.0581 1.0603 1.1005 1.0945 1.0989 1.1030 1.1038 1.0989 1.0991 1.1006 1.0909 1.0996 1.0891 1.0950 1.0639
irintensity: 0.9124 0.5659 0.4225 0.1748 0.1070 0.5092 2.4414 0.9957 0.1353 0.7118 0.4478 0.2679 2.0227 3.2429 0.9147 1.6437 1.8917 1.1773 4.8599 2.0583 3.5246 13.1166 25.4653 0.8881 29.3643 7.7506 11.1765 1.2196 2.9746 126.8795 2.4365 5.0079 4.0243 9.7872 7.6871 36.4582 4.2038 23.1623 13.8782 10.4003 4.7868 18.2782 3.1346 14.9743 1.3103 0.2515 211.3480 4.5430 1.3334 35.5134 28.5597 65.3423 23.1325 91.7779 6.2139 84.0387 16.1942 82.7487 31.0805 26.4825 1.3283 1.4816 28.8118 7.4608 13.9253 15.9427 3.4052 2.0102 35.4226 15.1840 41.9824 29.6112 19.2132 22.9251 5.0491 25.8111 0.1673 3.2811 13.4200 1.5622 6.1378 18.1856 13.7086 92.3212 42.3590 11.0819 8.8796 196.3709 42.0985 26.3061 14.0010 20.9746 12.1164 44.4287 25.5977 12.6999 29.3362 0.2840 30.9888 35.1075 12.7428 47.8871 15.0083 21.1741 38.3766 17.8454 9.4251 17.7587
temp: 298.150 k
press: 1.00000 atm
elementType: 8 8 8 6 6 6 6 6 6 6 6 6 6 6 6 6 6 6 1 1 1 1 1 1 1 1 1 1 1 1 1 1 1 1 1 1 1 1
symmnumber: 1
zpe: 833109.0 jmol-1
zpe.correction: 0.317314 hartree
zpe.thermalcorrener: 0.334636 hartree
zpe.thermalcorrenthalpy: 0.335581 hartree
zpe.thermalcorrgfe: 0.270908 hartree
zpe.sumelectzpe: -807.927433 hartree
zpe.sumelectthermal: -807.910111 hartree
zpe.sumelectthermalent: -807.909167 hartree
zpe.sumelectthermalfe: -807.973839 hartree
dipole: -0.5968 -0.8833 1.9595
dipole: 2.2307
quadrupole: -91.6135 -107.1846 -109.2294
quadrupole: 9.3179 0.9855 -5.3798
quadrupole: 11.0623 -4.5088 -6.5536 9.3179 0.9855 -5.3798
hfenergy: -808.2447477 hartree
pointgroup: C01 [X(C15H20O3)]
dipole: -0.2316845 0.4153217 -0.7375956 debye
polarizability: 236.3055975|-14.4012481|143.425535|-12.6906774|-9.5387723|135.5697325 unknown
InChI: InChI=1S/C15H20O3/c1-15(2)9-8-12-10-11(4-3-5-14(16)17)6-7-13(12)18-15/h6-7,10,16H,3-5,8-9H2,1-2H3
charge 0 multiplicity 1
38 atoms
O  -3.353471 -0.720383 0.65937
O  6.810478 0.541443 0.027364
O  5.160579 1.249599 1.498583
C  -4.191293 0.49542 0.354734
C  -3.898753 0.949917 -1.096632
C  -2.410799 1.309656 -1.296819
C  -1.504999 0.232054 -0.717793
C  -2.016778 -0.710181 0.21625
C  -5.632434 -0.00838 0.511273
C  -3.85305 1.577352 1.40258
C  -0.14647 0.12095 -1.098675
C  0.707959 -0.884502 -0.588572
C  -1.187608 -1.735003 0.73094
C  2.177772 -0.943037 -0.978988
C  0.15904 -1.817529 0.331118
C  3.080787 -0.115104 -0.024491
C  4.564241 -0.194969 -0.430715
C  5.478107 0.603655 0.476996
H  -4.542738 1.814709 -1.342868
H  -4.177813 0.122048 -1.776385
H  -2.191977 2.287249 -0.821222
H  -2.197654 1.439981 -2.374606
H  -5.850677 -0.797134 -0.229362
H  -5.781619 -0.43158 1.519658
H  -6.348819 0.820703 0.368618
H  -4.095018 1.208743 2.414263
H  -2.78134 1.839146 1.385696
H  -4.439166 2.496001 1.21457
H  0.251614 0.842238 -1.82636
H  -1.619047 -2.451188 1.437359
H  2.31126 -0.565844 -2.012928
H  2.526203 -1.995383 -0.977473
H  0.792146 -2.616951 0.735546
H  2.748629 0.939673 -0.021455
H  2.956502 -0.476319 1.013052
H  4.920534 -1.244655 -0.427485
H  4.716415 0.164706 -1.467462
H  7.385656 1.069899 0.645222
