program: Gaussian 09
title: 000148793
version: EM64L-G09RevD.01
frameworkgroup: C1[X(C3H7ClO2)]
method: RPBEPBE
basis: SDD
operation: Freq
keyword: #p
keyword: freq=noraman
keyword: PBEPBE/SDD
title: #p freq=noraman PBEPBE/SDD
converged: YES YES NO NO
title: Mulliken charges:
elementType: Cl O O C C C H H H H H H H
charge: -0.071378 -0.442849 -0.434951 -0.093823 -0.279805 -0.599235 0.254011 0.207268 0.200802 0.267816 0.293410 0.344997 0.353738
chargesum: 0.00000
title: Mulliken charges with hydrogens summed into heavy atoms:
elementType: Cl O O C C C
charge: -0.071378 -0.097852 -0.081213 0.160188 0.128264 -0.038009
polarizability: 5.47330354e+01 3.21860023e+00 4.19054872e+01 4.61131599e+00 3.82399018e-02 4.71768300e+01
1716.lowfreq: -17.0512 -5.9719 -0.0031 -0.0015 -0.0005 10.1022 97.7531 111.1851 188.7302
frequency: 97.6394 111.1498 188.7235 256.9745 345.6224 419.0032 464.7028 527.6042 558.3473 654.8818 816.3157 858.9584 969.6438 995.9985 1032.5285 1078.6211 1148.6897 1188.9540 1225.1912 1275.8069 1293.0642 1334.0693 1363.5132 1389.1516 1435.5011 1469.0988 2964.4712 3021.3592 3062.2274 3070.2584 3149.5473 3494.4729 3512.6439
redmass: 3.4259 5.2754 5.5494 3.7267 2.7011 1.1515 2.6077 1.1790 4.0822 4.4207 3.2272 1.9024 1.5923 4.0765 2.0838 1.6294 1.0852 1.3485 1.6144 1.3956 1.2429 1.2609 1.1687 1.2827 1.1054 1.0899 1.0664 1.0827 1.0640 1.0908 1.1114 1.0652 1.0649
irintensity: 11.4741 9.2611 2.8882 3.7792 2.4537 37.6511 1.0540 240.9974 59.8996 8.9265 50.5243 2.8650 14.1040 81.2492 30.9985 31.7339 57.9999 13.8117 5.5066 19.8479 13.0631 16.1592 49.0277 11.1282 18.7333 3.7551 43.6307 7.4500 5.4502 45.2728 7.2894 12.3901 11.7330
temp: 298.150 k
press: 1.00000 atm
elementType: 17 8 8 6 6 6 1 1 1 1 1 1 1
symmnumber: 1
zpe: 267812.4 jmol-1
zpe.correction: 0.102004 hartree
zpe.thermalcorrener: 0.109166 hartree
zpe.thermalcorrenthalpy: 0.110110 hartree
zpe.thermalcorrgfe: 0.070283 hartree
zpe.sumelectzpe: -728.498434 hartree
zpe.sumelectthermal: -728.491273 hartree
zpe.sumelectthermalent: -728.490329 hartree
zpe.sumelectthermalfe: -728.530155 hartree
dipole: -1.7919 0.2146 1.3125
dipole: 2.2315
quadrupole: -54.7263 -46.3868 -37.7133
quadrupole: 0.9296 -1.6383 -1.1608
quadrupole: -8.4508 -0.1114 8.5622 0.9296 -1.6383 -1.1608
hfenergy: -728.6004384 hartree
pointgroup: C01 [X(C3H7Cl1O2)]
dipole: 0.7922356 0.0371098 -0.3764997 debye
dipolederiv: -0.3707651 0.0667098 -0.1000742 0.0929474 -0.2139317 0.0565053 -0.1865547 0.0737633 -0.4067947 -0.5665888 -0.1180309 0.1499683 -0.1267564 -0.6593552 -0.19501 0.184205 -0.2149474 -0.4204721 -0.7960875 0.0785398 0.0849778 0.0606508 -0.3790979 0.1528676 0.1426872 0.1659437 -0.4454529 0.1800322 0.0848407 -0.0351362 0.0640419 0.4244889 0.1808124 -0.1574053 0.2460807 0.2613387 0.5289532 -0.1620969 0.025469 -0.0919317 0.2056416 -0.0436763 -0.0283734 -0.0133167 0.299398 0.2515163 -0.0551966 0.2690338 -0.1536711 0.1450598 -0.1473743 0.2903611 -0.1555806 0.5133846 0.0336867 0.0388972 -0.0865253 0.0183374 0.0265217 0.0630773 0.0146814 0.0085711 -0.0509468 0.0412128 0.0076001 0.0088338 0.0342421 -0.0434282 -0.1018595 0.0321407 -0.1332107 -0.0253395 -0.0399483 0.0631151 -0.0781636 0.0286025 0.0274303 0.0437385 -0.0792095 0.1059515 -0.1072526 0.0666096 0.0430599 -0.0347933 0.0638554 -0.0118338 -0.075845 -0.0207577 -0.0614452 -0.0490204 -0.0244937 -0.0494519 -0.0216448 -0.0779555 -0.003912 0.0831309 -0.0322097 0.0642103 -0.0054516 0.3163214 0.0285004 -0.1311539 0.052541 0.2995165 0.1073901 -0.1005155 0.0500213 0.1733078 0.3795512 -0.0264867 -0.0507914 0.0350963 0.1829 -0.1237571 -0.0590496 -0.1360413 0.2633015 unknown
polarizability: 52.5202671|-3.2266141|42.0711967|5.8331465|-0.4743057|49.2238887 unknown
InChI: InChI=1S/C3H7ClO2/c4-1-3(6)2-5/h3,5-6H,1-2H2
charge 0 multiplicity 1
13 atoms
Cl 2.139401 -0.463144 0.90437
O  -0.372472 1.409721 0.331621
O  -2.391754 -0.511434 -0.127804
C  -0.123774 0.29866 -0.608383
C  -0.988053 -0.912035 -0.200075
C  1.367473 0.01172 -0.770785
H  -0.498841 0.683919 -1.576654
H  -0.937625 -1.705763 -0.965694
H  -0.630375 -1.321782 0.768687
H  1.563662 -0.840462 -1.438969
H  1.92392 0.905568 -1.086898
H  0.167933 1.240807 1.150592
H  -2.415993 0.350724 0.367492
