program: Gaussian 09
title: 000148851
version: EM64L-G09RevD.01
frameworkgroup: C1[X(C19H22Br2N4O2)]
method: RPBEPBE
basis: SDD
operation: Freq
keyword: #p
keyword: freq=noraman
keyword: PBEPBE/SDD
title: #p freq=noraman PBEPBE/SDD
converged: YES YES NO NO
title: Mulliken charges:
elementType: Br Br O O N N N N C C C C C C C C C C C C C C C C C C C H H H H H H H H H H H H H H H H H H H H H H
charge: 0.006310 0.006315 -0.254254 -0.254258 -0.656640 -0.656615 -0.375098 -0.375085 -0.354563 -0.406415 -0.406404 -0.315240 -0.315249 0.525651 0.525642 -0.427834 -0.427821 -0.351582 -0.351539 0.364380 0.364284 -0.316351 -0.316344 -0.379380 -0.379448 0.067216 0.067194 0.227909 0.227922 0.198224 0.215014 0.198220 0.215014 0.212930 0.220823 0.220834 0.212928 0.256870 0.256873 0.301703 0.301699 0.220793 0.220889 0.314148 0.314929 0.314144 0.314944 0.213162 0.213151
chargesum: 0.00000
title: Mulliken charges with hydrogens summed into heavy atoms:
elementType: Br Br O O N N N N C C C C C C C C C C C C C C C C C C C
charge: 0.006310 0.006315 -0.254254 -0.254258 -0.027562 -0.027526 -0.161936 -0.161934 0.101268 0.006823 0.006831 0.118513 0.118513 0.525651 0.525642 -0.427834 -0.427821 -0.094712 -0.094666 0.364380 0.364284 -0.014648 -0.014645 -0.158587 -0.158559 0.067216 0.067194
chargesum: 0.00002
polarizability: 3.25970157e+02 -2.96422820e+01 3.05209410e+02 -5.44501715e-03 -2.70173127e-02 2.36519354e+02
1716.lowfreq: -7.1546 -3.8512 -3.7294 -0.0855 -0.0670 0.0002 5.5569 9.2689 9.2946
frequency: 5.2963 9.1349 9.2609 22.3795 28.4150 48.8054 52.2809 63.7828 77.7394 89.5001 100.0970 110.5168 121.3942 130.0425 133.4419 152.3483 152.5597 161.8008 198.0748 234.9072 243.3375 251.1146 261.2835 266.9156 267.5117 307.1042 307.2254 355.5249 359.7293 409.5323 409.9262 441.3151 441.4198 447.1622 447.5079 454.3112 463.4355 472.5651 494.9243 505.7769 506.6207 545.7835 548.0284 576.5675 582.5994 652.9920 653.0430 674.5594 674.7303 701.8680 703.5247 736.2506 736.2590 753.9947 795.7554 803.9268 803.9637 814.8298 817.4735 826.6690 844.3748 884.6983 913.0998 928.7746 931.3829 939.2411 943.4649 944.3583 952.1711 1012.0621 1023.0385 1023.2307 1039.2725 1039.4005 1067.6811 1071.6849 1072.0939 1083.9076 1102.8904 1127.7031 1132.5270 1132.5782 1162.6383 1164.5011 1172.3058 1199.6922 1236.2050 1239.5407 1242.4893 1261.7038 1263.4778 1268.4790 1294.0551 1299.5350 1349.2535 1349.4229 1354.9663 1362.3343 1364.4097 1372.8454 1383.8094 1384.7217 1414.4723 1414.6373 1447.0816 1451.5898 1468.2715 1468.4152 1482.2336 1488.9380 1489.3041 1552.8474 1552.9947 1596.5748 1596.6565 1611.4028 1612.2174 1635.5564 1635.5911 2954.0753 2954.1877 2978.3545 2979.2626 2993.2954 3017.5685 3019.1951 3028.4949 3040.5586 3066.0344 3132.9388 3132.9874 3167.2284 3167.2546 3172.5534 3172.5620 3331.4819 3331.5079 3535.7579 3535.7717 3680.1034 3680.1212
redmass: 8.1181 9.3830 9.6882 5.9810 8.8340 5.2036 4.8470 5.2104 2.2227 4.8508 4.4706 4.8857 7.2043 6.6247 7.3030 4.4459 4.7015 3.4351 3.5560 2.5568 3.3455 4.4700 3.8827 5.2503 6.4437 5.4367 5.4816 4.5347 3.6569 1.1814 1.1755 2.4464 2.3168 1.4054 1.3816 4.3934 4.8145 3.0406 3.5364 3.2941 3.3546 3.4208 3.5829 3.8455 3.6579 6.4615 6.4589 3.6722 3.6880 2.3579 3.2841 3.9123 3.9069 1.5858 2.5954 1.4761 1.4660 1.5623 1.4298 3.3102 2.4993 2.2218 3.5845 1.5621 1.4615 1.5503 1.3704 1.4002 2.7064 3.0882 3.4818 3.4674 1.6523 1.6513 2.0598 1.5802 1.5995 1.9524 2.4752 2.0819 2.0383 2.0379 1.4331 1.4039 1.2858 1.1665 2.5916 1.7794 1.5722 1.5548 1.6153 1.2990 1.0740 1.2049 3.0550 3.3795 1.4654 1.5018 1.6444 1.6564 3.4251 3.2023 4.7925 4.8173 1.0890 1.0736 1.2635 1.2355 1.0902 2.2974 2.3956 7.1491 7.1248 3.4483 3.4406 5.6053 5.7048 1.4163 1.4201 1.0552 1.0550 1.0615 1.0614 1.0601 1.1039 1.1051 1.1019 1.1022 1.1046 1.0885 1.0885 1.0935 1.0935 1.0927 1.0927 1.0763 1.0763 1.0451 1.0451 1.1034 1.1034
irintensity: 0.7633 1.6918 2.5313 0.2129 1.2143 5.7345 9.8153 4.2512 3.2784 0.9780 0.2880 2.5973 3.2395 0.5237 0.0000 4.2453 0.1535 1.4791 0.0064 6.0009 2.1379 13.1151 0.0008 0.2459 8.2697 5.0984 0.9169 11.0537 5.7725 130.2873 64.8063 42.3673 29.1273 115.5101 158.5727 25.5385 6.7601 25.1555 0.5377 0.2656 1.4033 23.2373 0.0079 49.5094 22.5363 1.1525 13.8556 5.0318 6.9636 33.7819 1.6784 4.4984 12.2827 37.1564 14.0738 6.5443 28.4101 113.3758 96.1794 39.3648 0.2301 12.7987 86.8052 0.3749 1.7092 15.1254 5.3789 23.1509 49.0995 58.5992 22.6760 83.6982 1.8009 29.6363 40.9448 159.0110 45.5617 11.8551 1.2965 1.1985 7.0351 32.2365 35.7056 73.8917 0.6780 14.7837 275.2058 36.1525 65.6424 139.5801 102.3678 8.5389 4.2515 8.0626 50.1281 64.0780 1.2144 83.3595 32.0235 5.1647 161.9973 19.0502 139.4473 40.8808 1.9831 10.8987 111.5193 51.2910 10.7156 123.1587 45.1542 64.3398 14.3316 40.6413 16.4966 154.6292 94.4274 60.2860 282.4966 54.7836 1.9544 11.4954 28.2715 33.6372 23.2180 61.4825 27.8946 14.9892 63.9571 23.9473 8.7923 8.5393 7.6751 10.8590 5.8692 31.6730 24.6064 17.2302 19.9739 21.1568 16.2840
temp: 298.150 k
press: 1.00000 atm
elementType: 35 35 8 8 7 7 7 7 6 6 6 6 6 6 6 6 6 6 6 6 6 6 6 6 6 6 6 1 1 1 1 1 1 1 1 1 1 1 1 1 1 1 1 1 1 1 1 1 1
symmnumber: 1
zpe: 1000945.0 jmol-1
zpe.correction: 0.381240 hartree
zpe.thermalcorrener: 0.409460 hartree
zpe.thermalcorrenthalpy: 0.410404 hartree
zpe.thermalcorrgfe: 0.314714 hartree
zpe.sumelectzpe: -1131.579280 hartree
zpe.sumelectthermal: -1131.551060 hartree
zpe.sumelectthermalent: -1131.550116 hartree
zpe.sumelectthermalfe: -1131.645806 hartree
dipole: -0.0017 0.0015 0.8879
dipole: 0.8879
quadrupole: -180.7852 -157.4303 -155.6137
quadrupole: -68.7653 0.0323 -0.0003
quadrupole: -16.1755 7.1794 8.9961 -68.7653 0.0323 -0.0003
hfenergy: -1131.96052 hartree
pointgroup: C01 [X(C19H22Br2N4O2)]
dipole: -0.0000218 0.3493109 -0.0004888 debye
polarizability: 336.5465172|-0.2104873|236.5198046|23.3926224|-0.015004|294.6325995 unknown
InChI: InChI=1S/C19H22Br2N4O2/c20-14-10-12(18(22)23)4-6-16(14)26-8-2-1-3-9-27-17-7-5-13(19(24)25)11-15(17)21/h4-7,10-11,22,24H,1-3,8-9,23,25H2
charge 0 multiplicity 1
49 atoms
Br -3.299843 -0.583305 3.228039
Br 3.297544 -0.599068 -3.233603
O  -2.867695 -1.80004 0.459629
O  2.859542 -1.811465 -0.464168
N  -7.699039 2.429145 -0.698111
N  7.70958 2.397371 0.690162
N  -7.762612 2.175606 1.709881
N  7.772879 2.140322 -1.717462
C  -0.005398 -2.480308 -0.001982
C  -1.221788 -3.338513 -0.41061
C  1.207675 -3.343042 0.406924
C  -2.449709 -2.5022 -0.775317
C  2.438852 -2.511348 0.771187
C  -3.946586 -0.927317 0.391341
C  3.942374 -0.943579 -0.396529
C  -4.315282 -0.249457 1.588856
C  4.314305 -0.268464 -1.594588
C  -4.704585 -0.674754 -0.780746
C  4.701364 -0.693416 0.775435
C  -6.133011 0.914691 0.436202
C  6.13725 0.888336 -0.442755
C  -5.385667 0.650544 1.615296
C  5.388843 0.626565 -1.621695
C  -5.782334 0.234683 -0.754768
C  5.78326 0.211053 0.748797
C  -7.263351 1.89476 0.521309
C  7.272185 1.863011 -0.52867
H  0.289108 -1.823727 -0.843087
H  -0.297406 -1.822334 0.838902
H  -0.963136 -3.965054 -1.288667
H  -1.496024 -4.028048 0.41158
H  0.946662 -3.968187 1.285282
H  1.479183 -4.033996 -0.414977
H  -2.204939 -1.753426 -1.557121
H  -3.284552 -3.140481 -1.129557
H  3.271237 -3.152659 1.125731
H  2.197001 -1.761193 1.552577
H  -4.462347 -1.194397 -1.71179
H  4.456623 -1.211085 1.706921
H  -5.683497 1.164427 2.533464
H  5.689162 1.138184 -2.540318
H  -6.370869 0.367766 -1.669547
H  6.372297 0.342228 1.663525
H  -8.493446 3.064993 -0.718858
H  -7.155003 2.322804 -1.55113
H  8.506571 3.029997 0.710287
H  7.164505 2.294889 1.542987
H  -8.520233 2.888548 1.68606
H  8.533449 2.850142 -1.694314
