program: Gaussian 09
title: 000148782
version: EM64L-G09RevD.01
frameworkgroup: C1[X(C4H5N3O2)]
method: RPBEPBE
basis: SDD
operation: Freq
keyword: #pfreq=noraman
keyword: PBEPBE/SDD
title: #p freq=noraman PBEPBE/SDD
converged: NO NO NO NO
title: Mulliken charges:
elementType: O O N N N C C C C H H H H H
charge: -0.253755 -0.200970 -0.217101 -0.353473 -0.464385 0.170714 0.225159 -0.261107 -0.128825 0.348618 0.257884 0.254972 0.311131 0.311140
chargesum: 0.00000
title: Mulliken charges with hydrogens summed into heavy atoms:
elementType: O O N N N C C C C
charge: -0.253755 -0.200970 -0.217101 -0.004855 0.157886 0.170714 0.225159 -0.003223 0.126147
polarizability: 9.08532791e+01 -2.39245076e+00 8.06518213e+01 1.01817271e-02 1.89269770e-03 3.29257699e+01
1716.lowfreq: -162.0953 -12.9833 0.0003 0.0008 0.0011 8.4550 13.1640 101.2925 166.1525
frequency: -162.0240 101.2865 166.1477 243.1411 326.6650 364.2219 440.8432 475.6962 515.7366 556.9769 623.3994 650.7975 681.7746 698.6790 732.7230 802.9186 855.3929 946.0232 1024.2169 1048.1373 1121.4074 1187.2206 1241.8293 1279.0816 1336.7562 1374.2463 1442.8126 1608.8586 1642.4573 1660.2237 1680.8106 3177.5322 3213.4949 3424.7138 3553.5610 3559.1324
redmass: 1.0985 5.7967 5.3544 4.2432 3.3467 11.3195 3.7077 10.1057 8.8175 4.4546 1.3169 2.7784 2.8098 2.3294 7.3097 1.7611 5.3920 1.2816 5.5631 2.9171 3.0950 2.1294 1.8373 1.1819 4.0539 1.6469 2.4280 5.1355 5.7144 1.7378 2.5018 1.0910 1.0987 1.0422 1.1010 1.0786
irintensity: 49.1682 16.5135 0.3693 7.9842 36.4094 15.8218 1.3613 3.8555 13.8953 10.8150 74.2905 81.5322 50.9174 32.2986 41.4473 71.0718 2.0999 0.0001 1.6739 15.1344 89.4387 7.9375 13.5011 0.9446 101.8725 12.2615 20.9254 175.3299 412.6229 187.8432 189.3658 4.9312 2.6055 6.1084 9.8288 78.9105
temp: 298.150 k
press: 1.00000 atm
elementType: 8 8 7 7 7 6 6 6 6 1 1 1 1 1
symmnumber: 1
zpe: 261736.4 jmol-1
zpe.correction: 0.099690 hartree
zpe.thermalcorrener: 0.106981 hartree
zpe.thermalcorrenthalpy: 0.107925 hartree
zpe.thermalcorrgfe: 0.067815 hartree
zpe.sumelectzpe: -469.452809 hartree
zpe.sumelectthermal: -469.445519 hartree
zpe.sumelectthermalent: -469.444575 hartree
zpe.sumelectthermalfe: -469.484685 hartree
dipole: -2.3154 4.3511 0.0003
dipole: 4.9288
quadrupole: -65.3342 -40.1028 -50.5967
quadrupole: 3.4754 -0.0022 0.0013
quadrupole: -13.3229 11.9084 1.4145 3.4754 -0.0022 0.0013
hfenergy: -469.5524993 hartree
pointgroup: C01 [X(C4H5N3O2)]
dipole: 0.9593352 1.6852064 -0.000121 debye
dipolederiv: -1.2102522 0.2461569 -0.0002131 0.373696 -0.6130909 0.0001157 0.0001544 0.0000016 -0.3843447 -1.0430761 -0.2190411 0.0000866 -0.4015826 -0.593168 0.0000992 -0.0005266 -0.0001366 -0.3404392 -1.185234 -0.1421969 -0.0002289 -0.005548 -0.0743602 0.0000296 -0.000107 0.0001419 -0.207596 -0.88551 -0.1114989 -0.0000406 0.7025698 -0.8200405 0.0000592 -0.0002839 0.0000459 -0.3274117 -0.3294641 -0.0843792 0.0001281 -0.0616275 -0.2378847 0.0001086 0.0001058 0.0000319 -0.0558093 1.6356617 -0.0601589 0.0001813 -0.4697665 1.1282506 -0.0001903 0.0001027 -0.0002248 0.3025632 1.5832035 -0.005625 0.000112 0.3386568 1.0079596 -0.0001588 0.0003749 -0.0001133 0.2734093 -0.355247 -0.1120884 0.0000552 -0.4080566 -0.5234987 -0.0000582 0.0000834 0.0001507 -0.2447507 1.0584742 0.1235928 0.0000584 -0.2179886 0.2234553 -0.0001358 0.0002543 0.0000236 -0.0186945 0.2139861 0.0396391 -0.0000115 0.0673958 0.1807077 0.0000498 -0.0000264 0.0000701 0.3609329 0.0324267 0.0641806 -0.0000402 0.0296869 0.0427212 0.0000388 -0.0000569 0.0000461 0.1897456 0.0865606 -0.0231027 -0.0000119 0.0073408 -0.0573302 0.000073 -0.0000087 0.0000727 0.1754228 0.1992502 0.1422974 0.1300664 0.0226281 0.1681232 0.0462262 0.0550615 0.0503882 0.1383859 0.1992203 0.1422245 -0.1301419 0.0225956 0.1681556 -0.046257 -0.0551274 -0.050498 0.1385865 unknown
polarizability: 90.9811853|2.0982448|80.5239151|0.0101237|-0.0021818|32.9257699 unknown
InChI: InChI=1S/C4H5N3O2/c5-7-3(8)1-2-6-4(7)9/h1-2,6H,5H2
charge 0 multiplicity 1
14 atoms
O  2.406946 -0.611707 0.00044
O  -2.325414 -0.847876 -0.000403
N  0.049222 -0.756056 0.000494
N  1.148577 1.3570 0.000261
N  0.121926 -2.173892 0.000343
C  1.280486 -0.04445 0.000597
C  -1.282397 -0.151667 0.000522
C  -1.254208 1.316402 -0.000021
C  -0.076597 2.014889 -0.000038
H  2.032087 1.870063 0.000131
H  -2.21709 1.828605 -0.000403
H  -0.036969 3.106916 -0.000364
H  0.582788 -2.514371 -0.852507
H  0.583545 -2.514456 0.852748
