program: Gaussian 09
title: 000148773
version: EM64L-G09RevD.01
frameworkgroup: C1[X(C14H12O)]
method: RPBEPBE
basis: SDD
operation: Freq
keyword: #pfreq=noraman
keyword: PBEPBE/SDD
title: #p freq=noraman PBEPBE/SDD
converged: YES YES YES YES
title: Mulliken charges:
elementType: O C C C C C C C C C C C C C C H H H H H H H H H H H H
charge: -0.295344 -0.094840 -0.280881 -0.459461 0.346698 -0.549237 0.173460 0.184926 -0.421688 0.424476 -0.486779 -0.385177 -0.428871 -0.259177 -0.245786 0.226675 0.236090 0.214045 0.244177 0.233362 0.219279 0.242603 0.238687 0.226092 0.240371 0.226889 0.229410
chargesum: 0.00000
title: Mulliken charges with hydrogens summed into heavy atoms:
elementType: O C C C C C C C C C C C C C C
charge: -0.295344 0.131835 -0.044791 -0.001238 0.346698 -0.096596 0.173460 0.184926 -0.179085 0.424476 -0.248092 -0.159086 -0.188500 -0.032288 -0.016376
polarizability: 2.19880501e+02 -8.16988270e+00 1.60089439e+02 6.09591625e+00 5.65830180e-01 7.46378361e+01
1716.lowfreq: -10.4665 -0.0004 0.0001 0.0009 1.6269 10.5250 71.0681 83.2923 144.7104
frequency: 71.0247 83.2746 144.7091 182.2051 220.0043 238.1368 337.1468 365.3391 402.8283 423.2546 436.8785 454.8033 499.4092 539.0727 544.7814 573.5401 636.8274 651.7011 674.3948 698.1428 727.5354 759.3098 793.4897 809.1238 830.3446 835.4598 858.6117 883.1983 888.7681 956.5605 965.0687 974.8783 977.9524 991.5236 1018.9929 1032.7249 1060.6641 1064.3255 1096.3721 1154.6160 1172.9740 1181.1495 1200.0165 1210.3620 1225.6330 1234.6367 1245.0368 1270.4831 1304.4089 1322.8907 1354.2564 1372.7933 1400.7910 1412.1454 1417.9171 1434.9704 1455.9943 1457.1274 1473.1170 1520.6305 1579.5570 1605.4636 1630.8117 2964.6435 3004.3080 3052.5019 3065.6445 3091.4754 3108.3982 3120.9286 3122.2755 3133.5565 3145.7578 3151.4997 3166.0106
redmass: 4.8296 3.2240 2.6091 5.2332 4.1174 3.4221 3.8600 3.7198 3.5926 3.6339 3.8407 4.3350 4.2657 3.4483 4.4668 6.0108 2.6049 5.1383 5.3909 4.2824 3.0360 1.3896 2.9840 3.7237 1.5257 4.2788 2.4778 1.7927 2.4711 1.3589 3.9710 1.5584 1.7574 1.3523 1.9941 2.2505 1.4938 1.7092 1.8188 1.3659 1.1803 1.2758 1.5894 1.8452 1.3311 1.6209 1.4212 1.5989 1.3908 1.6498 2.1662 1.7542 2.2551 5.5630 4.0492 2.8773 1.2412 1.1092 2.2150 3.8133 7.8779 5.9879 6.6732 1.0682 1.0606 1.0910 1.1014 1.0875 1.0949 1.0866 1.0861 1.0886 1.0980 1.0940 1.0994
irintensity: 1.7659 1.1911 0.2969 4.8960 1.9194 4.0381 3.3176 2.7939 5.2876 10.2649 2.0908 3.8684 1.3101 5.5931 6.5574 5.3604 2.1324 2.4464 3.9686 9.2687 17.1779 47.2230 19.6027 31.2847 50.4154 2.9819 2.6995 11.7824 8.1594 1.2384 1.9717 4.6275 2.6965 0.5322 1.6633 7.1092 3.9097 5.9642 3.2067 0.3594 1.3829 1.1621 3.8387 0.6825 4.5686 4.6350 1.6500 5.3936 0.8267 6.9210 8.9242 4.6293 7.8868 1.1444 4.7874 2.4364 16.7693 13.7273 1.5272 4.5805 2.1070 2.8736 0.1118 21.4251 36.2384 25.1365 12.9619 13.2752 71.3598 2.1281 4.6724 6.2391 24.7791 35.9830 28.9888
temp: 298.150 k
press: 1.00000 atm
elementType: 8 6 6 6 6 6 6 6 6 6 6 6 6 6 6 1 1 1 1 1 1 1 1 1 1 1 1
symmnumber: 1
zpe: 571020.4 jmol-1
zpe.correction: 0.217490 hartree
zpe.thermalcorrener: 0.228569 hartree
zpe.thermalcorrenthalpy: 0.229514 hartree
zpe.thermalcorrgfe: 0.180605 hartree
zpe.sumelectzpe: -614.844131 hartree
zpe.sumelectthermal: -614.833051 hartree
zpe.sumelectthermalent: -614.832107 hartree
zpe.sumelectthermalfe: -614.881016 hartree
dipole: 1.2069 -1.4616 -1.9469
dipole: 2.7172
quadrupole: -83.4282 -76.2248 -92.9172
quadrupole: 5.3200 8.5532 -1.7428
quadrupole: 0.7619 7.9653 -8.7272 5.3200 8.5532 -1.7428
hfenergy: -615.0616208 hartree
pointgroup: C01[X(C14H12O1)]
dipole: 0.4841339 -0.5698563 -0.7640046 debye
polarizability: 220.1595459|-7.0914341|159.8257238|5.9807046|0.3193537|74.622507 unknown
InChI: InChI=1S/C14H12O/c1-2-4-10-9(3-1)5-6-12-11(10)7-8-13-14(12)15-13/h1-6,13-14H,7-8H2
charge 0 multiplicity 1
27 atoms
O  -3.507026 0.590937 0.86155
C  -3.402892 -0.532258 -0.152088
C  -2.651964 0.735481 -0.408735
C  -2.605126 -1.749117 0.30863
C  -1.171183 0.759465 -0.233488
C  -1.17478 -1.775993 -0.291434
C  -0.437843 -0.442673 -0.178753
C  1.002611 -0.385389 -0.062428
C  -0.509888 2.027861 -0.157805
C  1.660013 0.907372 0.024314
C  0.872147 2.103861 -0.022663
C  1.832472 -1.559211 -0.042158
C  3.087143 0.970699 0.145982
C  3.222164 -1.467365 0.071834
C  3.859336 -0.191506 0.171486
H  -4.341356 -0.708471 -0.692712
H  -3.075057 1.481701 -1.093987
H  -3.134892 -2.680161 0.036103
H  -2.542987 -1.712132 1.411686
H  -1.233614 -2.059515 -1.363319
H  -0.606762 -2.57948 0.208493
H  -1.114037 2.941773 -0.199367
H  1.375494 3.075424 0.042396
H  1.374926 -2.549856 -0.123946
H  3.564596 1.955427 0.217032
H  3.830295 -2.37867 0.084748
H  4.949209 -0.132005 0.264429
