program: Gaussian 09
title: 000148762
version: EM64L-G09RevD.01
frameworkgroup: C1[X(C12H11N)]
method: RPBEPBE
basis: SDD
operation: Freq
keyword: #pfreq=noraman
keyword: PBEPBE/SDD
title: #p freq=noraman PBEPBE/SDD
converged: NO YES NO YES
title: Mulliken charges:
elementType: N C C C C C C C C C C C C H H H H H H H H H H H
charge: -0.697750 -0.139770 -0.553869 0.140929 -0.550661 0.312381 0.518783 0.323774 -0.436679 -0.446393 -0.451002 -0.444036 -0.230996 0.226842 0.226790 0.230920 0.230909 0.235066 0.231511 0.235491 0.207044 0.214854 0.312352 0.303510
chargesum: 0.00000
title: Mulliken charges with hydrogens summed into heavy atoms:
elementType: N C C C C C C C C C C C C
charge: -0.081888 -0.139770 -0.100238 0.140929 -0.088831 0.312381 0.518783 0.323774 -0.201613 -0.214882 -0.215511 -0.236992 -0.016141
polarizability: 1.99607735e+02 1.96123814e+00 1.52360108e+02 -2.19709584e-03 1.63630451e-03 6.13597966e+01
1716.lowfreq: -2.9156 -0.0005 0.0003 0.0004 10.0763 11.6695 86.9557 116.2541 196.3195
frequency: 86.9030 116.2519 196.3151 213.9581 258.0113 304.4986 319.4743 361.7658 404.1865 436.3671 460.6700 510.2362 525.4083 535.1270 544.8571 610.7590 636.6111 662.2648 723.8829 759.4787 765.8145 812.3038 816.7365 846.7815 899.5056 932.3662 946.5626 952.5374 967.7948 999.3776 1008.3383 1026.0995 1055.0059 1130.2252 1139.6313 1172.2440 1183.3944 1204.4690 1218.8266 1240.9160 1250.4789 1283.6936 1319.9468 1366.3209 1402.5611 1421.3167 1447.1081 1466.1560 1478.2363 1491.1809 1507.7837 1605.2479 1615.4804 1631.4702 1646.4963 2962.5785 2996.1834 3002.7214 3045.6954 3106.2460 3114.9560 3127.2076 3136.7242 3149.4559 3571.0563 3712.1294
redmass: 1.8897 3.6148 3.0800 3.1395 3.2631 1.2707 3.9963 1.0454 4.6890 3.4858 5.1641 4.9909 4.2302 3.4328 2.7206 5.4622 5.8746 3.4128 5.9784 1.8437 1.2698 4.6008 1.5623 2.2430 1.3839 3.3678 1.3559 2.7750 1.3678 5.2315 1.9081 2.2934 1.9939 1.6586 1.1654 1.2537 1.4445 1.1029 1.2694 1.8101 2.1928 1.7961 2.4811 3.0483 4.8908 2.2364 1.1677 1.3810 3.1530 3.6825 4.1769 8.4758 4.7800 1.6143 3.2559 1.0587 1.0607 1.1029 1.1028 1.0865 1.0854 1.0920 1.0960 1.0983 1.0447 1.1040
irintensity: 0.0482 4.7697 4.9473 6.8112 2.4139 232.3846 65.0222 1.7515 0.7476 0.0831 0.7033 0.9362 0.9609 0.1724 0.1872 2.6431 3.0182 1.7920 0.9173 31.0227 10.6432 2.4721 61.2823 28.3455 0.0696 2.1601 0.1139 10.2318 2.3774 1.0962 1.3691 6.5611 1.7756 13.4963 0.0209 0.5324 3.5539 0.0601 0.5918 2.6229 2.4208 4.4737 81.7182 13.7460 18.0803 12.5612 6.0396 3.1888 12.4768 21.2763 44.9572 3.7403 7.8562 24.6939 313.9018 38.5519 54.1089 13.0332 31.4299 15.8901 0.2952 22.4575 36.2021 44.2286 72.6845 19.0511
temp: 298.150 k
press: 1.00000 atm
elementType: 7 6 6 6 6 6 6 6 6 6 6 6 6 1 1 1 1 1 1 1 1 1 1 1
symmnumber: 1
zpe: 513463.5 jmol-1
zpe.correction: 0.195568 hartree
zpe.thermalcorrener: 0.205770 hartree
zpe.thermalcorrenthalpy: 0.206714 hartree
zpe.thermalcorrgfe: 0.160390 hartree
zpe.sumelectzpe: -517.749491 hartree
zpe.sumelectthermal: -517.739289 hartree
zpe.sumelectthermalent: -517.738345 hartree
zpe.sumelectthermalfe: -517.784668 hartree
dipole: -2.6549 1.1951 0.0017
dipole: 2.9115
quadrupole: -59.9854 -66.0735 -81.9793
quadrupole: -0.4907 -0.0073 0.0009
quadrupole: 9.3606 3.2726 -12.6332 -0.4907 -0.0073 0.0009
hfenergy: -517.9450588 hartree
pointgroup: C01 [X(C12H11N1)]
dipole: -1.0369992 -0.4865404 -0.0006862 debye
dipolederiv: -1.5750101 -0.1991856 0.000227 -0.5334964 -0.1670701 0.0000458 0.0009266 0.000104 -0.7325048 0.3122174 0.1454398 -0.0000172 0.1169608 -0.1945108 -0.000012 -0.0000171 -0.0000138 -0.0278386 0.0407654 -0.0244613 0.0000506 0.0416491 -0.0017949 0.0000285 0.0000569 0.0001648 0.201471 -0.622098 -0.1997876 0.0000194 0.2243793 0.2205096 -0.0000205 -0.0000286 -0.0001555 -0.1144413 0.0525874 0.017629 0.0000143 -0.1048975 -0.043547 -0.0000577 -0.000031 -0.0001917 0.1673109 -0.1007108 0.0280102 0.0000302 0.0910883 0.3159061 0.0000489 0.0000298 0.0001703 -0.0482344 -0.0695191 0.0650781 0.0000172 -0.1565513 -0.2179346 -0.0000052 0.0000147 -0.0000039 0.0608574 1.6635929 0.3390761 -0.0001146 0.4800719 -0.1039404 -0.000022 -0.0001549 0.0000232 0.1092867 0.0049974 -0.1195306 -0.0000243 -0.0600637 0.0277314 0.0000048 -0.0000124 -0.0000103 -0.1971141 0.1414143 -0.1953142 0.0000011 0.0009138 0.1169142 0.0000088 0.0000146 0.0000067 -0.1799931 0.1091988 -0.0466577 -0.0000029 0.0966722 0.073345 0.0000044 0.0000098 0.0000064 -0.201745 -0.2137877 0.048088 0.0000012 -0.3529171 0.1397181 -0.000008 -0.0000328 0.0000134 -0.2015895 -0.0630361 0.1182467 0.0000183 0.0406343 -0.0427953 0.0000078 0.0000206 0.0000032 -0.1754096 0.001379 -0.0537728 0.0837091 -0.0378538 -0.0331385 0.0618072 0.0946198 0.1217158 -0.0560732 0.0012192 -0.0539082 -0.0837635 -0.037933 -0.0331765 -0.0618267 -0.0946625 -0.1217169 -0.0559268 0.0339722 0.0048514 0.042975 0.0249063 -0.0405625 -0.086389 0.0529456 -0.1498547 -0.0415426 0.0339251 0.0049689 -0.0430042 0.02499 -0.0407023 0.0864198 -0.0529517 0.1498745 -0.0413416 -0.0427808 0.1042508 0.0000023 0.1312757 -0.0223625 -0.0000067 0.0000066 -0.000009 0.1562308 0.0736163 -0.050055 -0.0000039 0.0033435 -0.126698 -0.0000041 -0.0000082 -0.0000035 0.155362 0.0566859 -0.0239106 -0.0000035 -0.0898458 -0.1203527 -0.0000103 -0.0000109 -0.0000096 0.1597882 -0.1050065 0.1301697 -0.0000091 0.0993191 -0.0017659 0.0000096 -0.0000061 -0.0000017 0.1570553 -0.1539151 -0.0726607 -0.0000142 -0.0691032 0.0596793 -0.0000065 -0.0000173 -0.0000012 0.1604303 0.1981753 0.023548 -0.0000318 0.0604581 0.1115603 -0.0000703 -0.000311 -0.000177 0.3681169 0.2221176 0.009888 -0.0000766 0.0059995 0.124988 0.0000535 -0.0004006 0.0000666 0.3778451 unknown
polarizability: 199.6577276|-1.2173509|152.3101154|0.0021711|0.0016707|61.3597966 unknown
InChI: InChI=1S/C12H11N/c13-11-7-5-9-3-1-2-8-4-6-10(11)12(8)9/h1-3,5,7H,4,6,13H2
charge 0 multiplicity 1
24 atoms
N  -3.474108 -0.259049 -0.000034
C  0.259578 -0.116001 -0.000079
C  -0.959772 -2.189142 0.000047
C  -1.0495 -0.663909 -0.000093
C  0.592575 -2.496115 -0.000348
C  1.270162 -1.123963 -0.00012
C  0.549135 1.285127 -0.000052
C  -2.154157 0.205264 -0.000131
C  2.610559 -0.736574 -0.000067
C  -0.592752 2.154876 -0.000082
C  1.934804 1.657165 -0.000005
C  -1.889512 1.628016 -0.000127
C  2.930112 0.667607 -0.000001
H  -1.449838 -2.633215 0.889889
H  -1.450394 -2.633545 -0.889321
H  0.8800 -3.089901 -0.888317
H  0.880392 -3.090539 0.887059
H  3.420604 -1.475312 -0.000088
H  -0.452311 3.24256 -0.000068
H  2.215699 2.717414 0.000034
H  -2.746645 2.314871 -0.000133
H  3.984604 0.968126 0.000047
H  -3.674065 -1.254072 -0.000466
H  -4.25447 0.390409 -0.000547
