program: Gaussian 09
title: 000148763
version: EM64L-G09RevD.01
frameworkgroup: C1[X(C20H13NO)]
method: RPBEPBE
basis: SDD
operation: Freq
keyword: #p
keyword: freq=noraman
keyword: PBEPBE/SDD
title: #p freq=noraman PBEPBE/SDD
converged: NO NO NO NO
title: Mulliken charges:
elementType: O N C C C C C C C C C C C C C C C C C C C C H H H H H H H H H H H H H
charge: -0.263905 0.066335 -0.317613 0.337414 0.284497 0.498583 -0.543669 0.525001 -0.488991 0.464763 -0.444747 -0.482336 -0.023886 -0.433393 -0.430509 -0.216030 -0.214294 -0.561524 -0.354415 0.321119 -0.354043 -0.536889 0.261184 0.248769 0.277726 0.239246 0.238470 0.222189 0.224088 0.258770 0.261681 0.245481 0.222150 0.222151 0.246626
chargesum: 0.00000
title: Mulliken charges with hydrogens summed into heavy atoms:
elementType: O N C C C C C C C C C C C C C C C C C C C C
charge: -0.263905 0.066335 -0.317613 0.337414 0.284497 0.498583 -0.543669 0.525001 -0.227807 0.464763 -0.195979 -0.204610 -0.023886 -0.194147 -0.192039 0.006159 0.009794 -0.302754 -0.092733 0.321119 -0.108562 0.154039
polarizability: 4.85619861e+02 3.79548738e+00 2.48353209e+02 -5.75622606e-03 -1.56749450e-03 8.86384342e+01
1716.lowfreq: -0.0010 0.0003 0.0012 3.7997 8.4037 10.1658 41.6833 74.2206 85.5563
frequency: 41.6753 74.2128 85.5532 112.8431 148.4706 175.3629 190.8453 206.7630 226.3173 244.4881 262.3302 300.3877 328.6998 382.3033 404.7561 431.5890 465.2231 465.2293 471.4055 484.1750 488.1462 541.1184 551.1205 584.1796 589.4809 606.7625 638.8416 647.3953 653.0226 676.3015 731.8029 745.4623 759.0006 775.0951 792.0323 794.3707 817.7588 840.3241 863.2364 879.7722 899.9614 922.4300 930.6340 937.5021 942.2456 945.8167 962.2006 983.2953 992.2696 1003.6895 1015.4578 1042.0891 1095.5880 1109.1747 1112.9102 1132.8590 1149.7318 1173.1819 1175.2118 1192.3592 1224.1407 1231.6676 1239.5546 1250.9167 1283.5561 1292.8043 1340.2790 1360.7450 1393.6217 1397.9864 1414.8774 1423.2846 1437.1242 1445.4169 1462.6853 1467.4786 1471.5874 1476.9822 1490.3386 1510.7540 1545.7586 1600.1879 1613.0806 1625.2494 1629.2780 1633.1616 2956.5667 3043.5209 3121.8107 3122.5632 3124.3037 3127.4155 3135.7113 3145.1932 3145.2828 3147.0644 3155.0282 3163.8776 3168.1448
redmass: 4.6411 4.1111 4.0565 4.9954 5.0649 3.9676 3.0771 4.2017 1.5417 5.8874 2.8116 4.1222 4.4740 5.2704 5.5794 4.2440 3.1888 4.9529 3.3859 4.3593 7.4802 5.4347 6.6149 6.9725 6.2167 3.2808 3.5002 3.5150 7.4712 6.7116 6.4525 1.8888 5.9042 1.7796 1.6053 5.2433 1.7593 2.7601 1.8774 2.4773 6.8534 1.4805 4.0439 1.4833 6.2751 1.7277 1.3484 1.3815 1.3956 4.0397 3.0590 1.9582 2.7622 2.4105 1.2569 1.5253 1.4999 1.4313 1.3231 1.2768 2.7702 1.7993 1.9122 2.5537 2.9894 2.2472 2.5809 2.4332 5.5859 4.1538 3.2233 2.0699 2.4677 1.7272 6.1584 1.0501 1.5366 1.8842 4.1727 4.1931 8.8930 6.9548 8.4929 7.1560 7.9059 7.4621 1.0334 1.1038 1.0991 1.0860 1.0866 1.0925 1.0922 1.0933 1.0918 1.0874 1.0984 1.0969 1.0969
irintensity: 2.6941 1.6364 0.8149 1.2189 5.7043 5.4755 0.3484 3.6659 0.2420 0.1022 0.8763 1.4650 1.5409 1.2898 0.1298 2.6095 0.0007 0.5273 7.1944 1.7798 1.4183 30.8187 0.0602 4.3559 0.5326 1.3840 1.5522 3.4573 3.3182 5.1017 5.1138 0.3674 1.7266 4.0804 88.6017 0.0121 10.3189 47.6779 5.5133 49.4214 5.8688 1.4329 1.4542 1.1406 0.9475 21.7046 5.4297 0.1568 3.4633 78.6042 6.1220 6.6212 10.7062 5.5687 0.1666 18.9684 63.4675 71.4879 42.5185 0.1214 3.9737 16.2096 26.4527 192.2489 76.9590 1.4291 1.3692 26.8932 2.0619 0.0931 28.9706 1.1915 8.8604 4.4977 76.0779 13.6203 49.5010 17.8253 9.8506 96.4095 17.1700 1.7272 7.6820 59.9004 16.7116 98.9955 106.8197 48.3836 29.6536 1.4052 1.5610 7.5366 14.1859 40.4882 1.1261 2.6081 45.4312 18.3674 16.2298
temp: 298.150 k
press: 1.00000 atm
elementType: 8 7 6 6 6 6 6 6 6 6 6 6 6 6 6 6 6 6 6 6 6 6 1 1 1 1 1 1 1 1 1 1 1 1 1
symmnumber: 1
zpe: 705889.2 jmol-1
zpe.correction: 0.268859 hartree
zpe.thermalcorrener: 0.284668 hartree
zpe.thermalcorrenthalpy: 0.285612 hartree
zpe.thermalcorrgfe: 0.225989 hartree
zpe.sumelectzpe: -898.461169 hartree
zpe.sumelectthermal: -898.445360 hartree
zpe.sumelectthermalent: -898.444415 hartree
zpe.sumelectthermalfe: -898.504039 hartree
dipole: -1.0616 0.6313 0.0001
dipole: 1.2351
quadrupole: -85.6559 -114.7913 -133.7560
quadrupole: 6.9751 -0.0016 -0.0003
quadrupole: 25.7452 -3.3902 -22.3550 6.9751 -0.0016 -0.0003
hfenergy: -898.7300279 hartree
pointgroup: C01 [X(C20H13N1O1)]
dipole: 0.4175642 0.2485127 -0.0000242 debye
polarizability: 485.6224979|-3.7121623|248.3505728|-0.0057568|0.0015655|88.6384342 unknown
InChI: InChI=1S/C20H13NO/c1-22-14-8-9-18-13(10-14)11-17-15-6-2-4-12-5-3-7-16(19(12)15)20(17)21-18/h2-11H,1H3
charge 0 multiplicity 1
35 atoms
O  5.700942 0.966181 -0.000155
N  0.640541 -1.537455 -0.000146
C  -2.631187 0.044394 -0.000102
C  -1.798554 1.212432 -0.000105
C  -0.401981 0.727007 -0.000117
C  -1.860124 -1.162067 -0.000118
C  -0.438829 -0.74418 -0.000129
C  -4.05152 0.075982 -0.000058
C  0.832349 1.36393 -0.000121
C  2.024889 0.553922 -0.000136
C  -2.414743 2.469442 -0.000057
C  -2.524932 -2.391679 -0.000098
C  1.878538 -0.89749 -0.00014
C  -4.657534 1.379846 -0.000026
C  -4.714763 -1.19999 -0.000047
C  -3.850655 2.530742 -0.000029
C  -3.961786 -2.387725 -0.000071
C  3.330109 1.121501 -0.000119
C  3.056704 -1.701867 -0.000152
C  4.468196 0.299661 -0.00016
C  4.331523 -1.127158 -0.000164
C  6.921742 0.160457 -0.000241
H  0.922514 2.456576 -0.000103
H  -1.834832 3.399318 -0.000018
H  -1.971087 -3.335581 -0.000113
H  -5.749715 1.478095 -0.000005
H  -5.810365 -1.247243 -0.00003
H  -4.331975 3.515591 -0.000012
H  -4.488411 -3.349108 -0.000051
H  3.463664 2.208792 -0.000114
H  2.927858 -2.788706 -0.000173
H  5.214952 -1.772918 -0.000204
H  6.988892 -0.475918 -0.904647
H  6.98897 -0.475989 0.904106
H  7.746513 0.888503 -0.000244
