program: Gaussian 09
title: 000148747
version: EM64L-G09RevD.01
frameworkgroup: C1[X(C11H18O3)]
method: RPBEPBE
basis: SDD
operation: Freq
keyword: #pfreq=noraman
keyword: PBEPBE/SDD
title: #p freq=noraman PBEPBE/SDD
converged: YES YES NO NO
title: Mulliken charges:
elementType: O O O C C C C C C C C C C C H H H H H H H H H H H H H H H H H H
charge: -0.277335 -0.269344 -0.232884 -0.064985 -0.104494 -0.278798 -0.441272 -0.432150 -0.420612 -0.419038 -0.378875 0.283324 -0.230106 -0.670921 0.205203 0.280078 0.250243 0.227842 0.199762 0.201328 0.205050 0.217030 0.203825 0.202590 0.212003 0.188745 0.204064 0.228557 0.234877 0.213419 0.233321 0.229553
chargesum: 0.00000
title: Mulliken charges with hydrogens summed into heavy atoms:
elementType: O O O C C C C C C C C C C C
charge: -0.277335 -0.269344 -0.232884 0.140218 0.175584 -0.028555 -0.013668 -0.025772 0.000243 -0.004445 0.013935 0.283324 0.233327 0.005373
polarizability: 1.62682457e+02 5.55523442e+00 1.07231912e+02 -4.61881921e+00 5.19167672e-01 1.08153806e+02
1716.lowfreq: -37.8923 -7.9466 -0.0003 0.0003 0.0008 5.2650 11.2926 32.1274 51.1035
frequency: -21.7825 27.5541 51.0586 72.8416 82.9647 114.4588 148.2376 186.4127 228.6708 236.8667 258.6275 291.1874 305.5516 337.3749 375.3120 393.4652 418.7939 470.3938 502.8540 595.8299 672.8563 711.1999 763.1819 783.6242 795.9401 797.4711 812.8859 829.8489 835.9002 861.2322 868.1185 926.4159 936.4012 983.3812 1006.1281 1023.9168 1043.6416 1049.6370 1064.1766 1091.4304 1096.9755 1112.9435 1115.4009 1135.1640 1138.0791 1148.7673 1165.2110 1221.4739 1238.7740 1249.0576 1260.5817 1270.1547 1275.1669 1290.0504 1328.7166 1331.7470 1338.8275 1345.4620 1351.1050 1353.4275 1366.0835 1400.9008 1424.3124 1460.7500 1463.3405 1464.7001 1472.9973 1473.9015 1476.7540 1486.0700 1487.3224 1638.2845 2964.4980 2966.2051 2972.0346 2974.5874 2975.2865 2991.9727 2996.6264 3010.9433 3023.0668 3029.0478 3032.8080 3039.0754 3046.2693 3070.1570 3093.3240 3103.9486 3108.7001 3132.0233
redmass: 3.6121 3.2211 3.3425 3.8354 3.7376 3.4173 3.1027 2.5307 2.6497 1.8853 2.1106 3.5110 2.5051 4.1883 2.2596 3.0029 3.2763 2.2029 3.4682 2.4228 5.4373 6.8296 6.4157 1.4654 2.3195 1.3413 3.0916 3.4247 2.2023 2.3803 2.5503 1.8824 2.3329 1.9575 2.4981 2.3531 1.6573 1.6068 1.3785 1.4247 1.4634 1.9605 1.1722 1.6420 2.3463 1.7111 2.3992 1.7051 1.3249 1.1349 1.3062 1.2218 1.3015 1.4900 1.3658 1.4077 1.4187 1.4329 1.4291 1.4176 1.5291 1.2665 2.5516 1.0906 1.0400 1.0896 1.0621 1.0860 1.0865 1.0674 1.0913 10.8588 1.0636 1.0642 1.0642 1.0619 1.0639 1.0802 1.0359 1.0581 1.0990 1.0960 1.0989 1.1014 1.1028 1.1066 1.0985 1.0893 1.1027 1.0899
irintensity: 0.6371 0.8403 1.7521 0.5569 0.7021 1.0107 2.2981 2.4196 4.4326 0.5068 2.0084 2.2724 1.7186 15.1560 1.1839 2.4529 2.5523 2.0313 6.5451 5.7374 10.3094 10.2107 11.7232 0.2842 2.8020 1.4213 4.7536 21.4533 14.6041 6.5998 2.6576 23.6965 22.1698 14.1850 6.2574 77.4583 5.0855 0.3700 9.4693 0.4648 3.6809 25.0342 0.8325 83.8016 252.5852 19.2140 23.1525 11.7004 5.0203 0.0300 0.4077 7.9240 0.9564 5.0621 10.7090 17.9633 0.3215 25.4157 0.8960 1.3790 23.1842 21.6407 33.0688 5.7102 12.3059 5.8081 4.4782 10.0423 22.4650 15.2788 5.2165 144.2864 34.7577 19.0926 18.0499 23.2711 39.9877 58.0144 21.8422 16.8960 59.7503 68.4478 25.7791 24.8623 114.6472 7.0479 28.6036 8.7957 42.4291 9.6624
temp: 298.150 k
press: 1.00000 atm
elementType: 8 8 8 6 6 6 6 6 6 6 6 6 6 6 1 1 1 1 1 1 1 1 1 1 1 1 1 1 1 1 1 1
symmnumber: 1
zpe: 716975.4 jmol-1
zpe.correction: 0.273081 hartree
zpe.thermalcorrener: 0.287007 hartree
zpe.thermalcorrenthalpy: 0.287951 hartree
zpe.thermalcorrgfe: 0.231275 hartree
zpe.sumelectzpe: -654.490279 hartree
zpe.sumelectthermal: -654.476353 hartree
zpe.sumelectthermalent: -654.475409 hartree
zpe.sumelectthermalfe: -654.532085 hartree
dipole: 0.3901 2.5800 -1.7808
dipole: 3.1591
quadrupole: -66.6936 -89.4965 -88.2249
quadrupole: 2.7103 -0.4821 0.7934
quadrupole: 14.7781 -8.0248 -6.7533 2.7103 -0.4821 0.7934
hfenergy: -654.7633606 hartree
pointgroup: C01 [X(C11H18O3)]
dipole: 0.0108824 0.9914257 0.749487 debye
polarizability: 159.7553623|-12.5562372|109.7339651|-6.9889316|0.6100471|108.5788475 unknown
InChI: InChI=1S/C11H18O3/c1-2-13-11(12)10-9(14-10)8-6-4-3-5-7-8/h8-10H,2-7H2,1H3
charge 0 multiplicity 1
32 atoms
O  -0.294723 -1.599285 -0.081968
O  -2.989408 0.716776 0.380607
O  -1.914742 0.458099 -1.679938
C  1.774238 -0.325432 0.77103
C  0.561886 -0.354982 -0.147006
C  -0.833757 -0.269514 0.404519
C  2.890432 -1.275361 0.251606
C  2.316157 1.124072 0.942267
C  3.591067 -0.736667 -1.019772
C  3.025548 1.657302 -0.328436
C  4.141626 0.692389 -0.795193
C  -1.929742 0.321436 -0.435343
C  -4.164253 1.327089 -0.320553
C  -5.208068 1.627351 0.749124
H  1.437338 -0.699056 1.759557
H  0.682836 -0.005122 -1.180936
H  -0.987155 -0.218785 1.488277
H  2.460465 -2.27744 0.064302
H  3.647434 -1.392605 1.053875
H  3.045335 1.118282 1.777931
H  1.495276 1.805976 1.240981
H  2.878647 -0.726316 -1.869285
H  4.411303 -1.421173 -1.309711
H  3.448769 2.659227 -0.121188
H  2.290209 1.792054 -1.14736
H  4.937887 0.65724 -0.022245
H  4.611641 1.073117 -1.722444
H  -3.817978 2.235651 -0.846057
H  -4.523319 0.607064 -1.077709
H  -6.100857 2.081802 0.282257
H  -5.518974 0.703604 1.266018
H  -4.813216 2.331708 1.501091
