program: Gaussian 09
title: 000148716
version: EM64L-G09RevD.01
frameworkgroup: C1[X(C3H8ClNO)]
method: RPBEPBE
basis: SDD
operation: Freq
keyword: #p
keyword: freq=noraman
keyword: PBEPBE/SDD
title: #p freq=noraman PBEPBE/SDD
converged: YES YES NO NO
title: Mulliken charges:
elementType: Cl O N C C C H H H H H H H H
charge: -0.089640 -0.442871 -0.584487 0.041086 -0.452677 -0.590663 0.205220 0.241676 0.202795 0.275395 0.285570 0.281514 0.287418 0.339664
chargesum: 0.00000
title: Mulliken charges with hydrogens summed into heavy atoms:
elementType: Cl O N C C C
charge: -0.089640 -0.103207 -0.015555 0.246306 -0.008206 -0.029698
polarizability: 5.72136107e+01 2.18715314e+00 5.09274393e+01 2.55692610e+00 5.27826370e-01 4.63142541e+01
1716.lowfreq: -22.4744 -10.2230 -6.5337 0.0031 0.0034 0.0043 76.6649 141.0597 199.2852
frequency: 76.6498 141.0362 199.2772 224.7526 238.8446 253.9129 363.9604 467.2333 514.0744 635.4463 657.4618 801.5823 866.7854 958.2701 1018.9099 1065.2159 1108.0659 1114.9192 1188.1481 1216.7611 1264.9705 1291.0564 1311.3660 1364.7661 1391.2158 1423.4753 1468.0864 1643.5951 2923.6675 2953.7537 3027.2601 3076.2000 3163.9474 3480.7747 3563.8399 3610.4527
redmass: 4.4311 3.5684 2.9434 1.1576 1.1228 2.7835 2.5828 3.9347 3.9531 1.4811 2.9082 2.2943 1.8170 1.7169 2.3381 2.6910 1.8453 1.3719 1.1513 1.2766 1.2361 1.2567 1.1588 1.5497 1.4067 1.1575 1.0824 1.0917 1.0820 1.0624 1.1000 1.0569 1.1110 1.0459 1.0661 1.0982
irintensity: 4.2516 1.2457 12.5633 52.4239 111.5644 47.7637 6.4306 5.4895 27.7763 225.8244 24.8534 25.2957 11.0819 3.8452 57.5244 20.2351 57.1421 5.2829 1.2894 27.8751 11.9267 19.5913 0.3463 0.4378 8.3003 16.8267 7.1834 55.4140 32.3571 65.0447 41.2770 15.8613 3.8027 0.8643 5.4041 5.8108
temp: 298.150 k
press: 1.00000 atm
elementType: 17 8 7 6 6 6 1 1 1 1 1 1 1 1
symmnumber: 1
zpe: 299483.5 jmol-1
zpe.correction: 0.114067 hartree
zpe.thermalcorrener: 0.121882 hartree
zpe.thermalcorrenthalpy: 0.122826 hartree
zpe.thermalcorrgfe: 0.081787 hartree
zpe.sumelectzpe: -708.621485 hartree
zpe.sumelectthermal: -708.613670 hartree
zpe.sumelectthermalent: -708.612726 hartree
zpe.sumelectthermalfe: -708.653765 hartree
dipole: 3.3756 -0.8374 0.2874
dipole: 3.4898
quadrupole: -41.7427 -42.8095 -43.1244
quadrupole: 1.2402 -4.5291 1.2705
quadrupole: 0.8162 -0.2507 -0.5655 1.2402 -4.5291 1.2705
hfenergy: -708.7355519 hartree
pointgroup: C01 [X(C3H8Cl1N1O1)]
dipole: -1.2404076 -0.5163036 0.2826581 debye
dipolederiv: -0.2842691 -0.0863454 0.0407581 -0.126871 -0.3876714 0.1492705 0.1201676 0.2123138 -0.3684969 -0.4020696 0.3591258 0.0642393 0.3160087 -0.6344357 -0.037333 0.0379413 -0.0595212 -0.5704691 -0.4689872 0.1778031 0.0022858 0.2206699 -0.4361215 -0.0713094 0.0894588 -0.0762072 -0.7452052 0.2142917 -0.2236137 -0.0594099 -0.2087429 0.4815806 0.1405484 -0.0787847 0.2538326 0.3401016 0.3522223 -0.0807339 -0.1402305 -0.180823 0.3153042 0.064954 -0.0950334 -0.0178603 0.2459719 0.1844732 0.101686 -0.1609303 0.1923076 0.3712232 -0.3051593 -0.1462161 -0.3459648 0.42461 -0.0011832 -0.0156373 0.0952735 -0.0301111 -0.0662984 0.0860199 0.0485533 0.0024774 -0.1663413 0.0011645 0.046376 0.1176316 0.0386959 0.0333705 0.0215721 0.0567214 -0.030963 -0.161951 -0.0443209 -0.1091059 -0.0101589 -0.0928548 -0.1298067 -0.0397697 0.009009 -0.0097688 0.0871673 0.104148 0.0439499 0.1018564 0.0061502 -0.026069 0.0006086 0.0727188 -0.0013947 -0.0400861 -0.0462635 -0.0015736 -0.0507668 0.0189176 0.0570327 0.087148 -0.0269096 0.0872636 0.0156417 0.0226861 0.0239755 -0.0276353 0.0198577 0.1464343 -0.0379893 -0.1313586 -0.0132773 0.3331049 0.2235608 -0.0331557 0.0709866 -0.0118113 0.0694878 0.02901 0.0578493 0.0836884 0.2837127 0.1445468 -0.2027507 -0.0438997 -0.1613934 0.2059694 -0.0875708 -0.0141173 -0.0846184 0.3222396 unknown
polarizability: 52.4487807|3.1137227|54.6475636|-2.6250427|-3.3119151|47.3589598 unknown
InChI: InChI=1S/C3H8ClNO/c4-1-3(6)2-5/h3,6H,1-2,5H2
charge 0 multiplicity 1
14 atoms
Cl 1.197159 1.577012 -0.692799
O  0.812654 -1.709994 -0.233411
N  -2.057503 0.720463 0.216114
C  -0.045779 -0.732617 0.451338
C  -1.295726 -0.380711 -0.396429
C  0.829865 0.462168 0.801316
H  -0.39449 -1.138125 1.429918
H  -0.945487 -0.166254 -1.428967
H  -1.943503 -1.277993 -0.444126
H  0.322792 1.115961 1.523503
H  1.813762 0.133624 1.164414
H  -3.07301 0.655609 0.12694
H  -1.69831 1.648454 -0.025876
H  0.256977 -2.462098 -0.560235
