program: Gaussian 09
title: 000148746
version: EM64L-G09RevD.01
frameworkgroup: C1[X(C20H12O2)]
method: RPBEPBE
basis: SDD
operation: Freq
keyword: #pfreq=noraman
keyword: PBEPBE/SDD
title: #p freq=noraman PBEPBE/SDD
converged: YES YES NO NO
title: Mulliken charges:
elementType: O O C C C C C C C C C C C C C C C C C C C C H H H H H H H H H H H H
charge: -0.212110 -0.212150 0.017239 0.085978 0.176029 0.440926 0.451997 0.280481 -0.366612 -0.464134 -0.024885 -0.407252 -0.438677 -0.452307 -0.336132 -0.241820 0.209542 -0.357614 -0.361702 -0.220298 -0.231936 -0.238189 0.261532 0.247329 0.239751 0.248199 0.247882 0.257396 0.237273 0.245374 0.272476 0.230825 0.232717 0.182869
chargesum: 0.00000
title: Mulliken charges with hydrogens summed into heavy atoms:
elementType: O O C C C C C C C C C C C C C C C C C C C C
charge: -0.212110 -0.212150 0.017239 0.085978 0.176029 0.440926 0.451997 0.280481 -0.105080 -0.216805 -0.024885 -0.167502 -0.190478 -0.204425 -0.078736 -0.004547 0.209542 -0.112239 -0.089226 0.010527 0.000781 -0.055320
polarizability: 3.54734426e+02 1.81203422e+01 2.14984287e+02 -1.49381508e+00 7.75235029e-01 1.49913090e+02
1716.lowfreq: -9.9275 -5.9912 -2.8519 0.0003 0.0006 0.0007 14.8023 38.6300 62.6841
frequency: 14.1955 38.6020 62.6668 83.3562 122.0190 128.0343 174.1680 195.3348 201.4394 211.7978 256.9602 269.9353 311.1372 333.6497 374.8060 404.5227 429.4171 449.8192 458.0660 482.4169 484.1903 526.4831 544.6227 547.3251 559.6351 570.5797 615.6605 630.2337 704.5506 706.5107 715.9238 727.9501 741.4319 769.9760 772.3074 793.6849 814.3302 833.6530 853.4788 867.8328 874.3722 889.0421 932.3234 950.8588 966.0871 981.3140 990.7774 993.4954 1000.9942 1004.7865 1021.5953 1044.3281 1081.7679 1099.6128 1114.0461 1125.1993 1172.6664 1173.8551 1190.3268 1207.5491 1232.1820 1254.5064 1262.0374 1269.4552 1285.8168 1349.6884 1356.8119 1387.1473 1394.5552 1398.9060 1424.0060 1428.6600 1435.3539 1449.1275 1476.5359 1499.4642 1516.3491 1567.0402 1578.1959 1585.8645 1588.8605 1596.0754 1619.5867 1634.7948 2900.3478 3121.6050 3128.6660 3129.4633 3130.8777 3136.7700 3140.3079 3151.3474 3155.2617 3164.7383 3166.0534 3166.2719
redmass: 6.3314 7.1578 5.0534 7.3930 5.2646 5.4542 4.4341 4.1220 3.9550 4.4045 5.0915 5.0673 5.0759 6.0094 4.1090 6.7427 4.8095 4.1668 3.8400 7.3703 3.9891 4.9082 3.2838 5.0199 3.4971 5.1645 6.1705 6.5468 5.2700 4.3586 3.2816 6.4122 3.8852 1.2701 1.3032 5.0896 4.4576 2.5468 2.0485 4.8491 1.8548 1.3914 1.4315 6.2653 1.4486 1.3487 1.5712 1.3907 1.3869 1.4408 4.4311 2.3594 2.1610 2.1439 2.3557 1.5688 1.2348 1.0681 1.2885 1.9348 1.7879 1.6834 2.1956 2.6552 1.9461 3.1992 2.4806 3.1690 2.1406 2.7342 7.5568 2.2349 2.4918 3.1575 3.1987 4.1854 7.0429 7.2603 8.4563 5.8422 6.1320 6.5784 6.6058 7.1266 1.0847 1.0891 1.0855 1.0871 1.0877 1.0918 1.0891 1.0951 1.0973 1.0988 1.0977 1.0998
irintensity: 0.6594 1.6513 0.8875 2.3866 2.2366 0.6109 2.6225 10.3052 4.3141 4.0433 7.2216 1.5856 1.2323 7.0364 0.5526 2.9756 1.9725 3.4719 4.8778 8.7423 5.3793 2.3983 0.5702 2.5906 1.4463 4.2458 0.2105 10.8906 0.7527 15.9010 11.7706 1.1569 2.1524 71.0062 14.3974 5.9697 9.1330 3.9826 10.6084 5.6935 101.2084 0.5615 1.2526 4.7644 0.0615 0.1268 2.1814 1.4426 1.2644 1.7207 2.8587 1.1521 12.9949 0.6219 10.1487 17.1195 5.3106 2.4424 25.8367 32.7863 3.4186 21.5707 49.0453 39.2580 2.5221 2.5922 4.2951 20.6209 22.5548 10.6654 6.6595 8.9095 10.3473 4.5300 22.6412 5.7176 112.1642 12.0655 47.2520 119.1915 153.9024 4.1350 74.3850 62.5767 126.8696 10.8860 1.2714 2.7615 2.6643 12.2764 6.0453 12.8139 13.0331 31.3771 28.9365 18.8637
temp: 298.150 k
press: 1.00000 atm
elementType: 8 8 6 6 6 6 6 6 6 6 6 6 6 6 6 6 6 6 6 6 6 6 1 1 1 1 1 1 1 1 1 1 1 1
symmnumber: 1
zpe: 667997.3 jmol-1
zpe.correction: 0.254427 hartree
zpe.thermalcorrener: 0.271030 hartree
zpe.thermalcorrenthalpy: 0.271974 hartree
zpe.thermalcorrgfe: 0.208936 hartree
zpe.sumelectzpe: -918.324040 hartree
zpe.sumelectthermal: -918.307438 hartree
zpe.sumelectthermalent: -918.306493 hartree
zpe.sumelectthermalfe: -918.369531 hartree
dipole: -5.4991 -0.9599 -4.0149
dipole: 6.8761
quadrupole: -106.1921 -120.6563 -133.8647
quadrupole: 3.3173 -14.8564 5.4935
quadrupole: 14.0456 -0.4186 -13.6270 3.3173 -14.8564 5.4935
hfenergy: -918.5784671 hartree
pointgroup: C01 [X(C20H12O2)]
dipole: 2.145086 0.6099994 -1.5313624 debye
polarizability: 355.6690624|14.114632|212.1969251|0.4250785|10.7555313|151.7658155 unknown
InChI: InChI=1S/C20H12O2/c21-12-15-4-1-2-7-16(15)17-10-8-13-5-3-6-14-9-11-18(22)20(17)19(13)14/h1-12H
charge 0 multiplicity 1
34 atoms
O  -0.931282 -2.282699 0.107919
O  -3.162538 1.086832 2.979728
C  1.985961 0.015002 -0.082204
C  0.60454 -0.398386 -0.111089
C  -0.419099 0.579519 -0.227109
C  2.329464 1.414398 -0.149012
C  3.048659 -0.957279 0.010964
C  -1.878637 0.253882 -0.391228
C  -0.058787 1.96466 -0.280638
C  1.274686 2.375589 -0.239306
C  0.271981 -1.85704 0.024884
C  2.709811 -2.371835 0.082179
C  3.70742 1.812002 -0.121698
C  4.391277 -0.527623 0.031102
C  1.404633 -2.798797 0.085059
C  4.723043 0.854577 -0.033786
C  -2.828288 0.459437 0.655081
C  -2.34845 -0.13497 -1.671541
C  -4.213766 0.250137 0.411232
C  -3.72378 -0.339177 -1.902841
C  -4.664154 -0.148333 -0.858545
C  -2.382741 0.845027 2.01678
H  -0.860445 2.705677 -0.366808
H  1.524648 3.442045 -0.282198
H  3.531974 -3.095864 0.143201
H  3.952182 2.879309 -0.170742
H  5.190233 -1.27534 0.099682
H  1.140224 -3.859006 0.154218
H  5.772995 1.163372 -0.013851
H  -1.62806 -0.287666 -2.482174
H  -4.907542 0.403608 1.245217
H  -4.064806 -0.648238 -2.897363
H  -5.73118 -0.313539 -1.042085
H  -1.276376 0.904419 2.159969
