program: Gaussian 09
title: 000148807
version: EM64L-G09RevD.01
frameworkgroup: C1[X(C20H33N3O4)]
method: RPBEPBE
basis: SDD
operation: Freq
keyword: #p
keyword: freq=noraman
keyword: PBEPBE/SDD
title: #p freq=noraman PBEPBE/SDD
converged: YES YES NO NO
title: Mulliken charges:
elementType: O O O O N N N C C C C C C C C C C C C C C C C C C C C H H H H H H H H H H H H H H H H H H H H H H H H H H H H H H H H H
charge: -0.275326 -0.466794 -0.319857 -0.236213 -0.304042 -0.345120 -0.661748 0.272877 0.273621 -0.431304 -0.116343 -0.733713 -0.697064 -0.697615 -0.724525 -0.688122 -0.695789 0.312158 -0.314657 -0.443088 0.228917 0.217324 -0.340034 0.248479 -0.357019 0.139669 -0.780298 0.240157 0.233153 0.230355 0.204299 0.223985 0.232440 0.230110 0.200799 0.198130 0.281787 0.202104 0.196197 0.281109 0.202205 0.228804 0.209706 0.213912 0.222165 0.204675 0.229780 0.204976 0.209174 0.236583 0.227586 0.269629 0.260398 0.256155 0.381908 0.334666 0.336593 0.243340 0.242529 0.266216
chargesum: 0.00000
title: Mulliken charges with hydrogens summed into heavy atoms:
elementType: O O O O N N N C C C C C C C C C C C C C C C C C C C C
charge: -0.275326 -0.084886 -0.319857 -0.236213 -0.304042 -0.104963 0.009511 0.272877 0.273621 0.032204 0.087956 -0.047177 -0.016348 -0.018204 -0.083809 -0.047370 -0.051860 0.312158 0.149511 -0.173458 0.228917 0.217324 -0.079636 0.248479 -0.100865 0.139669 -0.028213
polarizability: 3.47220707e+02 -1.43576043e+01 2.25086177e+02 -6.09201560e+00 -1.19729321e+01 2.21334119e+02
1716.lowfreq: -21.6769 -8.9771 -0.0007 0.0006 0.0009 2.1104 7.5493 8.1645 14.2072
frequency: -20.0535 -3.2867 12.8550 22.7197 27.1734 39.1282 66.6161 76.9171 82.0732 95.8371 105.4006 115.5045 128.7933 135.9662 140.7260 156.0537 176.7487 184.7536 196.2099 213.7063 217.9478 229.0303 236.0887 242.1306 254.8761 268.7589 274.5015 280.2427 299.4741 310.3967 330.8655 335.5978 346.0361 365.8499 371.8383 377.6553 388.7541 394.3736 400.0434 419.3836 426.2773 436.2621 437.6034 465.9406 469.9964 498.3161 501.5055 518.2718 532.6034 542.4446 572.9385 609.2597 614.7767 644.2391 660.6028 671.6501 718.7972 724.1458 730.8921 742.2429 754.2915 795.8429 820.7040 832.4492 840.4058 882.8769 903.1437 910.4143 911.0159 914.7910 923.8222 924.1726 938.2154 941.8603 948.5307 952.9859 962.4231 974.6047 1002.5571 1009.6141 1018.0329 1021.9525 1031.7438 1033.6580 1045.4228 1060.7140 1068.6594 1069.5607 1099.6106 1112.5285 1136.0807 1178.1084 1201.1176 1208.6253 1218.4065 1227.8595 1229.3119 1238.4766 1248.9582 1253.0863 1260.8118 1263.7769 1280.6681 1298.4979 1325.4424 1335.2135 1354.8892 1357.3520 1367.9199 1370.0177 1371.4217 1372.6394 1374.2323 1375.9345 1393.0376 1395.1534 1397.8521 1401.4653 1441.8991 1447.1004 1447.3461 1447.9358 1455.4268 1460.7139 1460.9219 1462.3030 1462.7893 1470.5950 1472.1252 1477.6289 1479.5006 1484.1031 1486.8137 1488.4605 1493.9332 1502.7696 1548.5836 1567.8737 1580.8252 1606.5289 1627.3584 2935.4161 2966.6566 2971.1417 2977.6114 2982.0180 2982.2107 2987.8971 2989.1423 2994.7564 3011.0297 3060.3447 3064.1580 3066.6299 3067.8192 3070.0489 3073.0732 3076.1156 3077.6703 3080.4885 3084.6186 3085.9902 3090.6097 3091.5861 3110.9979 3116.0663 3127.0913 3142.3476 3157.2027 3164.4161 3301.9323 3409.8923 3543.8798 3700.4533
redmass: 2.5726 3.5362 4.3512 4.0034 4.0948 4.6129 4.4565 3.7487 3.9007 4.3150 3.9470 4.2453 3.7168 1.9340 1.4648 1.5284 4.2364 1.9133 1.5956 2.3200 1.8907 3.0649 1.7570 1.1874 2.3245 1.1131 2.4601 1.1212 3.0980 2.8388 2.6186 2.8794 3.6846 2.5006 4.8498 2.8812 3.8322 2.9732 3.0872 3.1325 2.0214 1.8572 1.9543 3.0622 2.6576 2.8501 2.6747 1.4558 2.4067 2.9887 4.1829 3.6250 3.8295 3.7641 3.6654 1.7233 8.6469 1.3861 2.3883 3.0726 3.9572 3.8220 2.8861 1.8165 2.5307 2.0088 1.8915 1.6544 1.5289 2.5708 1.6083 1.6119 1.2249 2.9465 1.2053 2.7729 1.3648 2.6800 1.6451 2.6654 1.4080 1.7759 1.7069 1.3887 1.8513 2.1152 2.4359 2.1065 3.3152 1.9726 1.3666 1.2666 2.2976 2.5290 2.1447 1.6136 2.8536 2.5716 2.7306 3.1840 1.5778 1.7151 1.8420 3.5483 1.4248 1.3611 2.2213 2.1954 1.2176 1.2235 4.3986 1.2497 1.2426 1.2473 1.2959 3.7372 1.2104 1.2386 1.1848 1.0641 1.0806 1.1089 1.1039 1.0546 1.0495 1.0505 1.0620 1.0533 1.0904 1.0826 2.0125 1.1293 1.0538 1.1044 1.0720 1.0614 6.3727 1.6203 7.0774 6.5684 2.7573 1.0694 1.0357 1.0366 1.0366 1.0366 1.0358 1.0386 1.0363 1.0601 1.0790 1.0984 1.0929 1.1000 1.0969 1.0995 1.0991 1.0951 1.0988 1.1097 1.1002 1.0998 1.0986 1.0995 1.0992 1.0986 1.1002 1.0885 1.0914 1.0966 1.0689 1.0736 1.0446 1.1045
irintensity: 0.0908 0.3677 0.4965 0.2013 0.2731 0.8069 2.0372 3.4889 2.0699 3.6954 1.8714 5.6463 1.9036 0.8676 0.5812 1.9827 4.5493 0.4376 2.7436 1.1039 2.4876 0.2616 8.5422 0.5586 1.6694 0.1257 1.5284 0.3998 3.9003 4.2088 3.3968 3.1041 8.4839 5.9613 0.3766 0.0209 4.6139 2.5837 2.0502 0.4293 58.5674 27.8597 50.5354 18.7610 11.7278 5.2829 12.8431 26.6713 30.2244 18.3845 26.2396 0.5163 7.1972 17.9250 15.1005 44.5953 22.1443 163.5812 47.4982 5.9950 26.2304 1.3717 11.6852 19.2701 8.2450 2.4819 14.2401 1.1787 3.5604 31.5188 10.6010 4.3175 0.1591 41.6379 0.4952 30.9197 3.0030 2.5801 3.3567 0.6676 2.5913 3.5721 24.0517 0.1698 1.7283 11.3109 46.5983 9.9559 30.7254 17.3194 40.2364 33.9475 119.5782 85.1156 116.9531 19.4544 9.8591 42.0995 114.6647 89.8879 27.5707 126.6317 5.7617 38.1497 22.6079 5.4229 8.1216 49.9859 39.9825 26.7593 321.9013 36.1695 36.5424 70.8886 32.0692 17.0635 29.5644 27.5705 91.8042 15.8227 27.0702 11.7782 5.7390 20.8171 0.7875 0.5556 16.5394 7.0493 47.7144 20.2685 86.1100 12.6894 7.5105 6.2926 22.7224 37.9363 184.2551 253.5785 145.0498 36.2096 324.5718 52.1225 31.0836 47.1876 37.9796 21.7666 10.7022 3.1852 25.6686 10.6647 69.1733 4.0456 4.2943 13.3857 72.7156 12.7355 38.9861 9.5441 85.3510 9.7346 9.7878 28.4375 85.1541 74.4766 0.8654 9.2207 11.9725 8.2907 6.2987 3.7161 470.0053 2.9801 27.9516 52.4578
temp: 298.150 k
press: 1.00000 atm
elementType: 8 8 8 8 7 7 7 6 6 6 6 6 6 6 6 6 6 6 6 6 6 6 6 6 6 6 6 1 1 1 1 1 1 1 1 1 1 1 1 1 1 1 1 1 1 1 1 1 1 1 1 1 1 1 1 1 1 1 1 1
symmnumber: 1
zpe: 1327362.0 jmol-1
zpe.correction: 0.505565 hartree
zpe.thermalcorrener: 0.534992 hartree
zpe.thermalcorrenthalpy: 0.535936 hartree
zpe.thermalcorrgfe: 0.445603 hartree
zpe.sumelectzpe: -1244.966831 hartree
zpe.sumelectthermal: -1244.937404 hartree
zpe.sumelectthermalent: -1244.936460 hartree
zpe.sumelectthermalfe: -1245.026794 hartree
dipole: 2.2641 3.1542 0.4251
dipole: 3.9058
quadrupole: -189.5240 -169.8542 -152.8834
quadrupole: 9.6157 -7.4021 -2.7246
quadrupole: -18.7701 0.8997 17.8704 9.6157 -7.4021 -2.7246
hfenergy: -1245.4723961 hartree
pointgroup: C01 [X(C20H33N3O4)]
dipole: 0.7411188 1.2708158 -0.4439985 debye
polarizability: 348.6554125|-2.9897883|213.1920291|-6.4626109|-8.5704874|231.7935615 unknown
InChI: InChI=1S/C20H33N3O4/c1-13(24)16-10-14(23(18(21)26)20(5,6)7)8-9-17(16)27-12-15(25)11-22-19(2,3)4/h8-10,15,22,25H,11-12,21H2,1-7H3
charge 0 multiplicity 1
60 atoms
O  1.563481 -0.137993 -0.298057
O  3.207445 -2.331806 0.000112
O  -6.105608 -1.328521 -0.103081
O  1.457592 -1.437193 2.103728
N  -4.095623 -0.080838 -0.056895
N  5.088414 0.721441 -1.175707
N  -4.094038 -2.429638 -0.42937
C  -4.81688 1.242503 0.200584
C  5.626196 2.032405 -0.679848
C  4.534294 -0.235847 -0.190688
C  3.594994 -1.249681 -0.893952
C  -3.77995 2.389239 0.286733
C  -5.791073 1.53839 -0.971757
C  -5.5861 1.155677 1.54659
C  6.246772 2.73988 -1.909332
C  4.459108 2.892738 -0.132942
C  6.712845 1.852388 0.422573
C  -2.654306 -0.13073 -0.143009
C  2.35465 -0.557878 -1.487496
C  -1.875728 -0.390311 1.007093
C  0.186393 -0.209922 -0.302006
C  -0.457796 -0.466187 0.95643
C  -1.994637 0.058039 -1.385461
C  -4.837468 -1.272309 -0.189686
C  -0.589755 0.029769 -1.465496
C  0.310359 -0.897731 2.171336
C  -0.345149 -0.729701 3.54025
H  5.790804 0.261414 -1.774438
H  5.301278 -0.826447 0.3574
H  3.946473 0.317012 0.56277
H  4.144342 -1.735614 -1.724429
H  -4.327185 3.328651 0.478751
H  -3.214248 2.511665 -0.653465
H  -3.058388 2.241553 1.109442
H  -6.313026 2.495754 -0.788441
H  -5.236304 1.624933 -1.924532
H  -6.539676 0.736751 -1.0643
H  -6.118438 2.106294 1.734885
H  -4.885217 0.981477 2.38442
H  -6.321316 0.336591 1.516061
H  7.079365 2.143397 -2.331783
H  5.485167 2.877484 -2.697439
H  6.650028 3.729525 -1.629968
H  4.000424 2.444667 0.766894
H  3.673263 2.999373 -0.901549
H  4.824157 3.898497 0.144403
H  6.304177 1.315942 1.298381
H  7.572008 1.272248 0.034621
H  7.090421 2.831842 0.771147
H  2.648187 0.333591 -2.070507
H  1.760527 -1.268929 -2.090523
H  -2.4002 -0.568754 1.951117
H  -2.595815 0.242999 -2.282216
H  -0.089878 0.222959 -2.419703
H  2.610221 -1.967729 0.722291
H  -3.081202 -2.443539 -0.5194
H  -4.628151 -3.289085 -0.529717
H  -1.140273 -1.485821 3.686963
H  -0.804043 0.267154 3.659473
H  0.41919 -0.886238 4.316346
