program: Gaussian 09
title: 000148719
version: EM64L-G09RevD.01
frameworkgroup: C1[X(C8H14Cl2N6O4)]
method: RPBEPBE
basis: SDD
operation: Freq
keyword: #p
keyword: freq=noraman
keyword: PBEPBE/SDD
title: #p freq=noraman PBEPBE/SDD
converged: YES YES NO NO
title: Mulliken charges:
elementType: Cl Cl O O O O N N N N N N C C C C C C C C H H H H H H H H H H H H H H
charge: -0.062715 -0.062700 -0.267927 -0.267885 -0.228367 -0.228339 -0.165740 -0.165780 -0.368857 -0.368852 0.039767 0.039750 -0.384023 -0.384269 0.348647 0.348575 -0.335695 -0.335718 -0.550700 -0.550686 0.292620 0.259220 0.259113 0.292788 0.254247 0.263056 0.263046 0.254255 0.355348 0.355337 0.270656 0.280585 0.270656 0.280590
chargesum: 0.00000
title: Mulliken charges with hydrogens summed into heavy atoms:
elementType: Cl Cl O O O O N N N N N N C C C C C C C C
charge: -0.062715 -0.062700 -0.267927 -0.267885 -0.228367 -0.228339 -0.165740 -0.165780 -0.013509 -0.013515 0.039767 0.039750 0.167817 0.167631 0.348647 0.348575 0.181607 0.181584 0.000541 0.000559
polarizability: 2.05826948e+02 -1.15731531e-02 1.77148407e+02 1.81878515e+01 -6.70028011e-03 1.15933103e+02
1716.lowfreq: -4.8265 -3.8156 0.0022 0.0023 0.0029 4.9927 6.3120 8.4866 21.5967
frequency: -2.1525 5.4097 21.4807 24.5259 45.6658 47.6282 56.7228 59.5492 76.7695 100.6382 102.0768 139.5382 145.5654 172.3271 172.5535 235.3381 236.8088 249.7779 262.8900 295.1641 318.9894 339.6417 341.0752 379.2588 415.1048 452.2321 455.5586 456.9262 474.1367 501.5435 554.2186 600.7075 601.2292 702.0084 703.3508 714.5724 715.3634 719.1160 740.8156 783.2263 806.4848 853.1147 855.6630 871.9857 918.0608 971.9175 984.7778 990.5711 1012.5118 1022.1758 1034.4217 1072.5350 1077.1336 1135.9325 1153.6077 1159.6513 1180.6477 1188.8413 1233.1549 1241.1126 1247.4114 1256.1101 1302.0597 1303.2979 1317.9380 1318.1109 1331.4501 1366.1233 1366.9314 1368.7067 1368.9186 1378.7660 1442.3670 1442.4113 1444.3960 1449.2933 1449.4246 1453.7724 1495.1591 1502.9063 1659.7585 1665.3538 3006.6025 3006.7073 3039.8032 3046.8363 3060.8237 3060.8438 3071.6273 3071.6498 3108.4334 3123.9145 3153.0708 3153.0963 3501.6187 3501.7309
redmass: 10.6281 10.1889 11.4152 4.6756 9.5078 16.8942 5.3889 8.1690 11.3924 4.3591 3.7099 9.7264 4.4995 7.4677 6.9783 6.0557 5.2153 4.9920 6.0869 2.5869 3.1995 2.8298 4.0785 4.5028 4.1895 5.7421 5.8046 7.3869 4.4178 3.9150 6.9519 4.4447 4.4324 4.7752 4.8509 1.2514 1.2974 2.2388 4.5525 2.0366 4.2851 2.3781 2.3830 3.8762 2.9755 2.3051 2.3938 2.4367 1.8568 2.1645 4.1079 3.2365 3.2649 2.9247 1.7748 1.4292 1.6361 1.8823 2.1659 1.3556 1.4445 2.6336 1.1933 1.1601 1.5281 1.3142 1.2607 6.0319 5.3089 1.3633 1.4502 1.3331 1.1000 1.0999 1.0785 1.0862 1.0850 1.1033 1.9162 1.9821 9.7967 9.4673 1.0597 1.0597 1.0590 1.0576 1.0717 1.0718 1.0876 1.0876 1.1035 1.1064 1.1118 1.1118 1.0775 1.0776
irintensity: 0.2909 1.1617 0.0034 1.3108 2.9715 1.3404 0.2179 7.0520 1.6364 2.2791 1.4306 0.3526 17.1465 6.4615 7.1082 1.3451 14.8047 13.6061 4.9379 4.2868 1.7202 48.2681 13.7642 16.0780 1.3522 7.3063 0.1640 3.6553 1.3370 9.5549 16.9102 30.5828 0.6178 2.5232 1.1381 53.5220 223.8656 0.0542 6.7587 8.5432 25.8815 114.9983 5.9975 175.7218 65.6615 40.2972 51.2360 3.8902 8.9051 75.0118 81.5295 12.7550 18.2399 6.0506 41.9288 9.3494 14.3813 2.5376 0.0447 45.2228 42.8142 184.4826 52.2085 10.1890 38.0527 22.0288 4.3690 250.4395 38.2910 0.7451 5.8341 5.9254 4.0347 13.9670 2.7258 68.6405 2.6075 34.7763 552.5076 269.2402 438.6384 35.0006 55.5752 9.0108 1.3493 4.0009 1.4121 14.1072 7.2795 18.7544 7.6849 1.2801 22.4662 4.3858 48.4516 51.3097
temp: 298.150 k
press: 1.00000 atm
elementType: 17 17 8 8 8 8 7 7 7 7 7 7 6 6 6 6 6 6 6 6 1 1 1 1 1 1 1 1 1 1 1 1 1 1
symmnumber: 1
zpe: 652091.8 jmol-1
zpe.correction: 0.248369 hartree
zpe.thermalcorrener: 0.269530 hartree
zpe.thermalcorrenthalpy: 0.270474 hartree
zpe.thermalcorrgfe: 0.192251 hartree
zpe.sumelectzpe: -1861.135109 hartree
zpe.sumelectthermal: -1861.113947 hartree
zpe.sumelectthermalent: -1861.113003 hartree
zpe.sumelectthermalfe: -1861.191227 hartree
dipole: 0.0010 -4.5238 0.0024
dipole: 4.5238
quadrupole: -132.8091 -137.8850 -132.9280
quadrupole: -0.0044 -18.9183 -0.0024
quadrupole: 1.7316 -3.3443 1.6127 -0.0044 -18.9183 -0.0024
hfenergy: -1861.3834772 hartree
pointgroup: C01 [X(C8H14Cl2N6O4)]
dipole: -0.0002853 -1.7798173 0.0008193 debye
polarizability: 201.6757594|0.0373953|177.1483649|26.2055444|-0.0498683|120.0843334 unknown
InChI: InChI=1S/C8H14Cl2N6O4/c9-1-3-11-7(17)15(13-19)5-6-16(14-20)8(18)12-4-2-10/h11-12H,1-6H2
charge 0 multiplicity 1
34 atoms
Cl -6.151276 -1.328373 -1.541435
Cl 6.150056 -1.327336 1.543397
O  -1.747217 -1.158106 1.366443
O  1.746207 -1.159313 -1.36429
O  -2.123136 3.016864 -0.531164
O  2.124392 3.018821 0.526373
N  -1.846575 0.982114 0.385293
N  1.846997 0.982825 -0.387556
N  -3.769988 -0.410047 0.439194
N  3.769772 -0.410449 -0.439363
N  -2.693761 1.919867 -0.207929
N  2.694558 1.921221 0.204265
C  -0.419029 1.251582 0.654061
C  0.419503 1.252475 -0.656503
C  -2.446327 -0.290724 0.774458
C  2.446027 -0.29116 -0.774301
C  -4.527442 -1.628286 0.737958
C  4.526446 -1.629747 -0.735846
C  -4.955472 -2.386713 -0.519544
C  4.953632 -2.386385 0.523023
H  -0.333057 2.23052 1.154392
H  -0.082103 0.446938 1.32655
H  0.082602 0.448723 -1.330051
H  0.333768 2.232131 -1.155376
H  -5.418062 -1.378144 1.343481
H  -3.873203 -2.283975 1.341917
H  3.871872 -2.285993 -1.338836
H  5.417375 -1.381231 -1.341578
H  -4.220867 0.366723 -0.055333
H  4.221129 0.367026 0.053633
H  -5.514393 -3.301025 -0.270985
H  -4.110532 -2.605434 -1.187929
H  5.511831 -3.301578 0.276094
H  4.108373 -2.603311 1.191589
