program: Gaussian 09
title: 000148966
version: EM64L-G09RevD.01
frameworkgroup: C1[X(C16H17NO8)]
method: RPBEPBE
basis: SDD
operation: Freq
keyword: #p
keyword: freq=noraman
keyword: PBEPBE/SDD
title: #p freq=noraman PBEPBE/SDD
converged: YES YES NO NO
title: Mulliken charges:
elementType: O O O O O O O O N C C C C C C C C C C C C C C C C H H H H H H H H H H H H H H H H H
charge: -0.321437 -0.197958 -0.456219 -0.465478 -0.444036 -0.463502 -0.181400 -0.384603 -0.049363 -0.145611 -0.151977 -0.099638 -0.090742 -0.027143 0.160119 0.327293 -0.540188 0.376005 -0.413231 0.378250 -0.403395 -0.412855 -0.410730 -0.241468 -0.243390 0.228221 0.248862 0.251967 0.260128 0.242622 0.371040 0.383397 0.369277 0.291864 0.406038 0.275289 0.238982 0.246122 0.391715 0.239794 0.229022 0.228358
chargesum: 0.00000
title: Mulliken charges with hydrogens summed into heavy atoms:
elementType: O O O O O O O O N C C C C C C C C C C C C C C C C
charge: -0.321437 -0.197958 -0.085179 -0.082080 -0.074760 -0.057465 -0.181400 0.007113 -0.049363 0.082610 0.096884 0.152329 0.169385 0.215480 0.160119 0.327293 -0.248324 0.376005 -0.137942 0.378250 -0.164413 -0.166733 -0.170937 -0.012446 -0.015032
polarizability: 2.61257511e+02 -1.86067505e+01 2.24934517e+02 4.22395808e+01 -5.40525040e+00 1.70878381e+02
1716.lowfreq: -7.3498 -5.0403 0.0005 0.0006 0.0007 4.4476 16.1785 27.6703 31.7194
frequency: 15.8669 27.6487 31.6869 47.3491 59.1702 92.7116 95.2657 97.9193 130.3653 175.0194 184.8717 190.0339 210.0700 220.8400 256.0939 260.4448 279.7168 296.6439 307.8615 336.5528 353.9614 375.8278 382.7406 396.9245 405.2567 410.8216 440.0290 453.1842 466.3465 479.8929 489.5236 509.4492 512.0306 519.7617 534.4343 549.1432 560.9310 587.2188 600.0655 602.6414 618.5907 629.2060 647.3674 669.6472 692.0689 733.6126 757.6301 762.1874 783.7839 827.7014 833.2952 864.2318 875.8084 902.3974 917.4175 926.0959 947.7713 961.8136 967.0742 976.7050 981.6022 992.0875 1000.0023 1022.1743 1024.3061 1034.8546 1042.3795 1063.8588 1073.2043 1075.0436 1088.9396 1112.4115 1149.4982 1156.2104 1172.8806 1179.8077 1216.5152 1225.2340 1225.9538 1233.2218 1251.4169 1255.9028 1275.7358 1277.6255 1294.3352 1300.0192 1310.0700 1324.4469 1342.5688 1351.8056 1375.8240 1389.7918 1398.5300 1403.0976 1409.4679 1423.6918 1437.2537 1453.9432 1510.5431 1577.5340 1596.7054 1635.7525 1691.2452 2930.4272 2955.9922 2977.0384 2997.3014 3010.3755 3120.3724 3127.2511 3129.6859 3143.4898 3146.7699 3162.2250 3182.1237 3225.9683 3507.5166 3519.1053 3551.9333 3560.7780
redmass: 7.0662 6.6212 4.5251 11.1784 7.0011 6.0524 7.9915 7.5989 6.4605 6.4575 4.8972 4.4610 7.3327 4.3327 5.2351 5.0767 5.0525 6.4118 6.6146 5.6318 7.2310 2.9106 4.2269 2.3501 1.9295 3.9650 1.2653 4.2804 5.4853 2.6667 4.4396 2.6160 5.1302 1.4739 3.4224 3.0226 2.0586 3.4052 2.0321 5.7391 3.0766 2.8522 4.0200 3.3618 4.2003 6.1978 2.2869 2.0327 2.7028 5.4585 1.3800 6.3750 1.5393 6.8602 1.9533 3.6487 6.4890 1.3723 5.7334 3.0620 1.5979 1.3435 6.3803 2.2521 3.8450 5.5311 3.0925 2.8663 2.9928 3.1895 2.5710 2.0006 1.6811 1.2820 1.0816 1.3064 1.1942 1.2804 1.1566 2.2897 1.5268 1.2150 1.7656 1.5993 1.2616 1.2125 1.2185 1.2500 1.4255 1.7688 1.6547 1.3445 1.6151 1.5619 3.5587 3.4032 3.8128 2.3039 3.7364 7.5014 5.6485 6.7580 9.7923 1.0801 1.0821 1.0835 1.0853 1.0852 1.0860 1.0887 1.0898 1.0951 1.0921 1.1005 1.0941 1.0657 1.0656 1.0640 1.0656 1.0656
irintensity: 1.1977 0.8279 0.0295 1.1176 1.2437 0.2734 2.4556 4.4442 1.1830 6.0049 1.2780 2.8986 5.3467 5.7450 9.6482 6.4504 5.2161 7.8574 12.9481 7.0041 2.9328 28.8416 4.7310 46.9522 58.8642 14.4117 167.6892 4.3247 100.5563 24.0136 0.3093 73.1609 4.0567 65.2441 10.1114 8.6501 192.3308 8.2337 249.5759 76.3929 60.4260 30.9744 17.3349 19.8936 55.9412 65.3402 31.9992 15.8387 2.7836 37.3095 34.8340 41.2149 32.7596 149.2838 10.3598 36.5321 89.9461 10.8237 33.6135 8.4643 5.1957 0.1452 258.6783 6.1620 72.2568 63.7379 95.4498 5.3927 11.8447 15.3957 132.4600 1.2971 10.1409 1.9741 0.7455 9.3373 15.6902 17.7988 17.1602 6.2081 2.2686 9.3300 6.9371 21.7786 13.2117 29.2355 16.6879 29.8595 17.2559 13.8014 17.9612 28.8272 7.6854 14.4059 2.7101 0.3792 1.9417 4.8749 27.6539 0.2612 16.2009 14.6016 207.2676 12.0592 16.5516 11.4027 13.3011 57.1814 2.6680 0.5644 11.7541 29.5442 1.7874 36.6632 2.6136 147.2494 89.0300 28.8246 21.5521 29.8940
temp: 298.150 k
press: 1.00000 atm
elementType: 8 8 8 8 8 8 8 8 7 6 6 6 6 6 6 6 6 6 6 6 6 6 6 6 6 1 1 1 1 1 1 1 1 1 1 1 1 1 1 1 1 1
symmnumber: 1
zpe: 824505.6 jmol-1
zpe.correction: 0.314038 hartree
zpe.thermalcorrener: 0.336757 hartree
zpe.thermalcorrenthalpy: 0.337701 hartree
zpe.thermalcorrgfe: 0.261054 hartree
zpe.sumelectzpe: -1274.477302 hartree
zpe.sumelectthermal: -1274.454583 hartree
zpe.sumelectthermalent: -1274.453639 hartree
zpe.sumelectthermalfe: -1274.530287 hartree
dipole: 3.3571 -0.3526 -7.0523
dipole: 7.8185
quadrupole: -119.6418 -138.3409 -157.0749
quadrupole: -8.2976 -1.8238 11.0147
quadrupole: 18.7107 0.0117 -18.7224 -8.2976 -1.8238 11.0147
hfenergy: -1274.7913401 hartree
pointgroup: C01 [X(C16H17N1O8)]
dipole: 1.2071564 -0.2931703 -2.8140443 debye
polarizability: 265.0250299|-15.993046|223.7820148|39.4656992|-7.543572|168.2633639 unknown
InChI: InChI=1S/C16H17NO8/c18-11-12(19)14(15(21)22)24-16(13(11)20)25-17(23)10-6-5-8-3-1-2-4-9(8)7-10/h1-7,11-14,16,18-21,23H
charge 0 multiplicity 1
42 atoms
O  1.890597 -0.570945 0.560344
O  0.591894 0.592067 2.139228
O  3.711857 3.002557 -0.57127
O  4.115973 0.687546 -2.202794
O  1.151674 3.089026 0.730586
O  4.12634 -2.044651 -1.858897
O  2.757772 -3.027967 -0.255073
O  0.421126 -1.808761 2.460058
N  -0.366368 -0.595564 2.376017
C  2.789994 1.867516 -0.62533
C  3.541851 0.54838 -0.86596
C  2.007155 1.907171 0.70137
C  2.513891 -0.614526 -0.762511
C  1.091496 0.678933 0.795202
C  3.103914 -2.017889 -0.886421
C  -1.405103 -0.64599 1.353643
C  -2.072011 0.537779 0.999593
C  -3.183691 0.498799 0.102672
C  -1.848237 -1.913378 0.84715
C  -3.62915 -0.776295 -0.426735
C  -2.93584 -1.964151 -0.024151
C  -3.878638 1.693104 -0.290929
C  -4.746719 -0.808284 -1.323977
C  -4.963896 1.629819 -1.166763
C  -5.402938 0.369564 -1.68885
H  2.072902 2.000414 -1.466507
H  4.328417 0.406479 -0.095941
H  2.721072 1.897239 1.550096
H  1.758536 -0.487756 -1.573285
H  0.284378 0.712359 0.032903
H  4.243265 3.000609 -1.40864
H  4.561347 -0.169155 -2.439974
H  1.737304 3.876733 0.585026
H  -1.740045 1.495149 1.415982
H  4.481765 -2.969875 -1.951711
H  -1.339841 -2.823232 1.174742
H  -3.277968 -2.93303 -0.407145
H  -3.543062 2.656937 0.109546
H  1.000014 -1.85629 1.629537
H  -5.081488 -1.774971 -1.719355
H  -5.48788 2.54658 -1.458846
H  -6.25696 0.336253 -2.374133
