program: Gaussian 09
title: 000148702
version: EM64L-G09RevD.01
frameworkgroup: C1[X(C20H14O2)]
method: RPBEPBE
basis: SDD
operation: Freq
keyword: #pfreq=noraman
keyword: PBEPBE/SDD
title: #p freq=noraman PBEPBE/SDD
converged: YES YES NO NO
title: Mulliken charges:
elementType: O O C C C C C C C C C C C C C C C C C C C C H H H H H H H H H H H H H H
charge: -0.379871 -0.239376 0.169542 0.328495 -0.033682 0.003002 0.311167 0.224057 0.170195 0.432875 -0.436645 -0.511578 -0.830762 -0.439854 -0.381188 -0.344335 -0.450612 -0.062236 -0.267652 -0.262422 -0.269741 -0.251388 0.252290 0.236178 0.238572 0.241371 0.241093 0.229563 0.277495 0.259116 0.241975 0.229896 0.232321 0.231921 0.231266 0.378952
chargesum: 0.00000
title: Mulliken charges with hydrogens summed into heavy atoms:
elementType: O O C C C C C C C C C C C C C C C C C C C C
charge: -0.000919 -0.239376 0.169542 0.328495 -0.033682 0.003002 0.311167 0.224057 0.170195 0.432875 -0.184355 -0.275400 -0.109726 -0.210291 -0.103693 -0.085219 -0.208637 -0.062236 -0.037756 -0.030101 -0.037819 -0.020122
polarizability: 3.99316345e+02 -2.50478873e+00 2.53721655e+02 -4.48554910e+00 1.20249371e+01 1.00998419e+02
1716.lowfreq: -7.9955 -3.0439 -0.0005 -0.0005 0.0000 3.7697 34.0178 58.0568 78.8307
frequency: 33.9975 58.0316 78.8273 96.8163 105.9985 138.5040 147.5844 176.6820 195.1050 215.3105 250.7437 277.7156 298.1393 337.6234 352.3280 367.8684 415.2533 419.1661 449.1669 452.5255 507.4019 516.2646 518.6701 526.8077 560.0741 577.1510 588.4298 605.5781 629.8138 652.0889 657.4027 697.9473 708.9716 720.9297 764.6621 772.4073 783.0828 793.0923 801.7448 818.6162 847.3772 887.6718 892.9570 899.3978 930.3643 946.3525 962.6287 963.9733 981.7016 992.8058 993.5352 1028.5478 1039.3638 1040.5360 1057.7643 1069.1588 1079.9204 1109.5911 1155.1560 1181.3785 1182.3043 1186.9635 1233.2218 1240.5490 1257.0165 1272.7723 1301.6091 1317.1626 1336.9610 1366.5982 1381.4739 1395.4754 1403.2196 1414.8893 1429.5983 1437.5373 1454.3624 1471.2686 1482.8115 1498.6562 1505.0049 1546.0569 1557.7592 1567.6433 1612.9947 1616.7793 1622.9100 1630.8760 2985.7292 3054.1813 3123.0157 3126.3484 3128.2918 3133.1224 3136.7878 3150.7327 3156.1799 3170.6577 3171.0148 3172.9199 3179.5115 3495.8029
redmass: 5.9856 3.4942 5.3471 3.0615 4.3773 2.8774 1.7773 3.6517 5.4357 4.3055 5.8834 4.6877 6.0606 4.0880 5.8711 4.2568 3.3290 3.9006 4.6978 3.8794 4.4406 3.2473 3.8238 4.2995 3.0405 5.2594 3.4637 2.1639 3.8779 5.8763 3.0932 3.6777 4.4989 4.0153 1.2925 1.7229 2.6675 5.0049 4.7976 1.6864 1.8435 1.5738 4.9900 2.8048 4.8470 5.0968 1.3873 1.4179 1.3727 1.3471 1.3438 2.2779 1.7273 2.8638 2.7318 1.9655 2.6537 2.3636 1.5729 1.2771 1.1784 1.1396 1.8186 1.7670 1.7910 1.7146 2.3266 2.6966 4.6661 4.1769 4.2010 3.6813 1.2987 2.3237 2.8017 4.3094 2.3588 1.6365 1.0531 2.7880 1.8873 6.1035 5.4078 7.8361 6.2399 6.0065 8.2189 6.4152 1.0423 1.0973 1.0869 1.0921 1.0892 1.0865 1.0895 1.0906 1.0951 1.0937 1.0975 1.0942 1.0970 1.0638
irintensity: 1.1934 0.2946 0.7482 0.7749 1.1133 3.4479 0.4894 0.2396 0.7738 0.5686 1.4514 2.1034 1.0680 1.9917 1.2512 0.1359 5.3769 0.1105 2.1429 1.7639 1.8306 1.5578 3.6975 5.5325 35.1550 14.5535 1.7146 61.4817 51.0952 3.5635 30.3694 7.5969 4.2501 9.6410 71.2247 50.5339 0.8252 4.8203 0.2481 20.5599 29.3712 14.4792 1.1603 4.4902 19.3903 52.6273 4.6117 6.0323 1.5499 0.2521 0.2140 7.7258 2.1678 22.8326 53.1277 93.7721 54.6427 7.7603 1.7534 6.7085 1.3551 1.3266 2.3994 2.6939 5.2112 7.6926 24.5219 14.5063 1.1671 12.2462 8.8421 6.5547 12.3979 3.5631 2.8874 8.4810 2.1296 9.3671 13.6753 17.4722 49.9900 1.4485 2.2967 5.7266 36.2500 3.8525 192.4555 7.0741 26.0669 14.3592 1.6733 17.9934 9.1801 2.1627 12.4167 16.0263 33.4322 35.3684 13.2194 20.0285 25.0711 27.6542
temp: 298.150 k
press: 1.00000 atm
elementType: 8 8 6 6 6 6 6 6 6 6 6 6 6 6 6 6 6 6 6 6 6 6 1 1 1 1 1 1 1 1 1 1 1 1 1 1
symmnumber: 1
zpe: 729946.2 jmol-1
zpe.correction: 0.278022 hartree
zpe.thermalcorrener: 0.295085 hartree
zpe.thermalcorrenthalpy: 0.296029 hartree
zpe.thermalcorrgfe: 0.233489 hartree
zpe.sumelectzpe: -919.525270 hartree
zpe.sumelectthermal: -919.508207 hartree
zpe.sumelectthermalent: -919.507263 hartree
zpe.sumelectthermalfe: -919.569803 hartree
dipole: -0.3558 2.2165 0.7352
dipole: 2.3623
quadrupole: -104.8970 -113.2361 -133.9239
quadrupole: 4.5865 -0.2396 -3.5599
quadrupole: 12.4553 4.1162 -16.5716 4.5865 -0.2396 -3.5599
hfenergy: -919.8032922 hartree
pointgroup: C01 [X(C20H14O2)]
dipole: 0.1624698 -0.8759388 0.2647415 debye
polarizability: 399.1721353|1.744599|254.2827469|8.5561373|-7.1983378|100.5815376 unknown
InChI: InChI=1S/C20H14O2/c1-12-14-7-4-5-9-17(14)19(20(21)22)18-15(12)11-10-13-6-2-3-8-16(13)18/h2-11,21H,1H3
charge 0 multiplicity 1
36 atoms
O  0.480335 2.340274 1.711333
O  -0.456257 3.327815 -0.161245
C  0.441341 -0.160421 0.053345
C  -0.013598 -1.543835 0.073358
C  -1.399515 -1.870012 -0.000845
C  -0.53877 0.867457 0.125736
C  -2.370895 -0.820613 -0.106285
C  -1.93875 0.569604 -0.010734
C  1.889338 0.10353 -0.064043
C  2.821312 -0.978706 0.125144
C  0.976491 -2.597297 0.218968
C  2.32333 -2.325202 0.300654
C  -1.812618 -3.333753 0.041795
C  -3.780991 -1.080402 -0.260821
C  -2.938056 1.608028 -0.036203
C  2.429399 1.372857 -0.434939
C  4.226041 -0.736891 0.066517
C  -0.17645 2.279395 0.471982
C  -4.716878 -0.051244 -0.300331
C  -4.289757 1.308842 -0.179307
C  3.813991 1.591658 -0.509802
C  4.725818 0.538254 -0.2286
H  0.637858 -3.634118 0.283547
H  3.047814 -3.135127 0.446216
H  -2.899804 -3.472898 -0.019701
H  -1.360449 -3.904382 -0.790748
H  -1.480931 -3.810761 0.983041
H  -4.134412 -2.109757 -0.357131
H  -2.6219 2.652228 0.018738
H  1.765661 2.19183 -0.72372
H  4.911742 -1.576238 0.232593
H  -5.780683 -0.280543 -0.425016
H  -5.028165 2.117144 -0.212089
H  4.190866 2.576817 -0.805371
H  5.805576 0.7155 -0.277044
H  0.716767 3.290468 1.898806
