program: Gaussian 09
title: 000148636
version: EM64L-G09RevD.01
frameworkgroup: C1[X(C6H14N2OS)]
method: RPBEPBE
basis: SDD
operation: Freq
keyword: #p
keyword: freq=noraman
keyword: PBEPBE/SDD
title: #p freq=noraman PBEPBE/SDD
converged: YES YES NO NO
title: Mulliken charges:
elementType: S O N N C C C C C C H H H H H H H H H H H H H H
charge: 0.226841 -0.270197 -0.050996 0.068639 0.277605 -0.670732 -0.696016 -0.664602 -0.707048 -0.862597 0.240461 0.218469 0.207637 0.241573 0.235199 0.195856 0.205675 0.219270 0.235381 0.253819 0.319075 0.250889 0.263711 0.262089
chargesum: 0.00000
title: Mulliken charges with hydrogens summed into heavy atoms:
elementType: S O N N C C C C C C
charge: 0.226841 -0.270197 -0.050996 0.068639 0.277605 -0.004165 -0.023388 -0.004276 -0.134154 -0.085908
polarizability: 1.15359468e+02 3.78807820e+00 1.13311441e+02 2.88154822e+00 -1.60230983e+00 7.85379784e+01
1716.lowfreq: -19.8398 -11.9557 -9.0309 -0.0016 -0.0001 0.0009 30.7144 38.4931 61.8328
frequency: 30.0690 38.1623 61.6400 111.9976 149.0534 179.6811 196.1744 225.4171 256.3203 266.8921 291.2957 314.4780 325.0784 358.4736 384.5324 405.7333 460.7076 501.6764 567.2922 644.7182 665.1869 742.1452 817.5485 865.4912 915.6413 926.2042 951.9988 956.6477 969.1237 1008.7281 1024.1530 1056.0514 1104.9480 1204.6943 1228.4827 1247.3102 1273.0597 1304.3274 1330.0635 1340.7299 1377.5203 1382.9350 1405.2705 1411.3888 1447.2333 1452.6380 1459.8581 1461.0489 1467.8464 1477.2038 1480.6903 1495.9672 2983.2488 2989.7215 3001.2852 3002.6538 3048.5427 3077.9560 3087.9764 3092.1641 3095.0182 3100.2332 3117.7859 3118.8707 3126.4485 3140.0521
redmass: 3.0156 4.5795 2.8150 4.5215 1.1875 1.0845 3.8526 3.7095 1.0467 3.6088 1.1292 2.7145 3.2926 2.1122 2.9082 3.1504 3.2140 4.6173 3.3924 6.1366 6.6603 2.7212 2.5628 3.6225 1.6936 1.5941 1.1999 1.1804 1.5704 1.6569 1.3949 1.7347 3.4030 2.0544 2.9923 2.3023 1.6130 1.4015 6.6774 1.1423 1.1953 1.2116 1.1727 1.1793 1.0550 1.0495 1.0507 1.0479 1.0487 1.0564 1.0556 1.0595 1.0352 1.0350 1.0370 1.0291 1.0571 1.0993 1.0991 1.1009 1.1003 1.0996 1.1035 1.0997 1.1037 1.1067
irintensity: 1.2589 1.4711 0.4874 0.3132 0.0933 0.4104 1.2872 0.8750 0.0507 5.8506 0.2856 1.2975 0.2468 1.3254 2.0253 1.2489 1.5698 5.1780 1.5616 5.0199 21.8406 2.6210 1.2148 68.6857 1.0691 3.0419 1.1403 6.9418 69.1662 19.4755 0.7751 6.3469 77.3203 56.4576 22.1654 33.0010 30.3652 21.3778 70.2378 2.0969 25.2035 14.0016 29.8572 10.5223 9.2882 0.2522 9.4611 8.6250 5.2482 11.0885 16.0689 25.9501 19.8376 17.8759 18.8599 31.6168 11.1324 17.3867 38.1143 11.5781 20.9894 60.4373 15.3440 21.0806 15.2800 2.3578
temp: 298.150 k
press: 1.00000 atm
elementType: 16 8 7 7 6 6 6 6 6 6 1 1 1 1 1 1 1 1 1 1 1 1 1 1
symmnumber: 1
zpe: 520396.4 jmol-1
zpe.correction: 0.198209 hartree
zpe.thermalcorrener: 0.211441 hartree
zpe.thermalcorrenthalpy: 0.212386 hartree
zpe.thermalcorrgfe: 0.157941 hartree
zpe.sumelectzpe: -818.923308 hartree
zpe.sumelectthermal: -818.910076 hartree
zpe.sumelectthermalent: -818.909131 hartree
zpe.sumelectthermalfe: -818.963576 hartree
dipole: 1.3147 -5.7647 1.4896
dipole: 6.0975
quadrupole: -67.0909 -78.0757 -67.7099
quadrupole: 2.7498 -0.2120 1.7943
quadrupole: 3.8679 -7.1169 3.2489 2.7498 -0.2120 1.7943
hfenergy: -819.121517 hartree
pointgroup: C01 [X(C6H14N2O1S1)]
dipole: -0.8414746 2.2235785 0.3201501 debye
dipolederiv: -0.2240482 -0.1943459 -0.0480854 -0.0258342 0.0031512 0.0280631 0.0231356 0.0918795 -0.1694005 -0.475924 0.754894 -0.0465335 0.0505042 -0.8530067 -0.0199503 -0.0718108 0.2560947 -0.2303157 -0.4573353 -0.1552879 0.0825081 0.1748721 -0.9647838 0.0356445 -0.0098631 -0.1745863 -0.2721295 0.0409717 -0.5405304 0.0400822 -0.2340534 1.3848824 0.0294262 -0.0352362 -0.0159639 -0.0393872 0.5640479 -0.2519911 -0.0433722 -0.286914 0.2911945 -0.035539 0.0418246 -0.1174053 0.3212968 -0.0454965 0.0106606 0.0512152 0.0282262 -0.0619762 0.0536688 0.0343935 0.0607256 -0.0193472 -0.0359514 -0.0489952 -0.0217287 -0.0668809 0.0182863 -0.0546468 -0.04824 -0.0219931 -0.0136072 -0.0324788 0.0638337 0.0308995 0.0743546 0.0003776 -0.0203615 0.0440924 -0.0017616 -0.0902513 0.6166744 0.2776162 -0.1389003 0.2432006 0.0629673 -0.0870266 -0.0614339 -0.0184723 0.2407371 -0.0584563 0.0219246 0.0461073 0.0170888 0.1244197 -0.0250772 0.0708266 -0.0248866 0.0466188 0.056482 -0.0015706 0.1044965 0.0216377 0.0559967 -0.0543645 0.1097934 -0.0290536 -0.0553649 -0.0927384 0.1257869 -0.0616828 0.0968422 0.0078144 0.0369483 -0.04374 0.0502659 0.0863409 0.005321 -0.123211 -0.0587799 -0.1234493 0.0018358 -0.0427909 -0.1044172 -0.0746482 -0.0149214 0.0794186 -0.0515332 0.0234285 -0.0882985 -0.0250601 0.0642206 0.0435641 0.0941499 0.0243122 0.0546404 0.0290338 0.0846592 -0.0016238 0.0687121 -0.0619024 0.0606069 -0.060762 -0.0777261 -0.0742479 0.0982816 -0.0464874 0.1686734 -0.020673 0.0428963 -0.0422055 0.0138892 0.0857856 -0.024897 -0.1113309 -0.1110855 -0.1002233 0.0242258 -0.0799301 -0.0696236 -0.0612465 -0.005479 -0.0786354 0.1296292 -0.0129765 0.130707 0.0034547 0.0136601 -0.0459568 0.0262611 0.0731533 0.0760916 -0.0423264 0.0509505 -0.0756284 -0.0457538 0.1121534 0.0450895 0.0624347 0.0096766 0.0300564 0.0044687 0.0712265 0.0136176 -0.0396153 -0.0800456 0.0771087 -0.0513164 0.0555969 -0.0133688 -0.070358 0.01926 0.0171425 0.0459986 0.1138559 0.0266719 0.0283201 0.0149837 0.1223017 0.0219209 0.0138356 -0.0427756 -0.0664657 -0.0641766 -0.0288473 -0.1028603 -0.0760917 0.0205737 0.1011944 -0.1119593 0.063018 -0.0696175 0.0667177 -0.1041918 0.0423317 0.0258479 -0.0530014 -0.0477638 0.0829225 -0.0542035 0.0536349 0.0285566 0.0884588 0.0286034 0.079672 unknown
polarizability: 113.9233596|3.3570229|114.1481178|-4.7129529|-3.7367558|79.1374098 unknown
InChI: InChI=1S/C6H14N2OS/c1-6(2,3)8(7-9)5-10-4/h5H2,1-4H3
charge 0 multiplicity 1
24 atoms
S  2.499631 0.02644 -0.362787
O  0.685514 -2.61647 0.215309
N  -0.234322 -0.568634 0.193907
N  -0.36187 -1.927303 -0.082586
C  -1.419362 0.313913 -0.110032
C  -0.945145 1.529829 -0.947783
C  -2.470955 -0.485705 -0.91713
C  -2.043983 0.789345 1.231068
C  0.996303 -0.083061 0.818694
C  2.680117 1.896315 -0.542574
H  -0.422372 1.193117 -1.859963
H  -1.823186 2.129823 -1.245879
H  -0.270275 2.188419 -0.373606
H  -2.847452 -1.353418 -0.353729
H  -2.052101 -0.858006 -1.866736
H  -3.317386 0.188287 -1.142012
H  -1.324639 1.365076 1.841994
H  -2.910169 1.443965 1.027007
H  -2.39246 -0.074642 1.823215
H  0.832561 0.909711 1.25875
H  1.311199 -0.809455 1.58437
H  2.725812 2.381339 0.446093
H  1.870089 2.3251 -1.151486
H  3.642352 2.047916 -1.057702
