program: Gaussian 09
title: 000148630
version: EM64L-G09RevD.01
frameworkgroup: C1[X(C7H16N2O2)]
method: RPBEPBE
basis: SDD
operation: Freq
keyword: #p
keyword: freq=noraman
keyword: PBEPBE/SDD
title: #p freq=noraman PBEPBE/SDD
converged: YES YES NO NO
title: Mulliken charges:
elementType: O O N N C C C C C C C H H H H H H H H H H H H H H H H
charge: -0.273982 -0.306125 -0.382839 -0.108251 -0.326640 -0.390580 -0.350473 -0.686215 0.285158 -0.602390 -0.483164 0.215731 0.192129 0.204627 0.255385 0.189987 0.195052 0.328978 0.213431 0.213843 0.209870 0.275940 0.218722 0.230741 0.223175 0.229745 0.228144
chargesum: 0.00000
title: Mulliken charges with hydrogens summed into heavy atoms:
elementType: O O N N C C C C C C C
charge: -0.273982 -0.306125 -0.053860 -0.108251 0.081221 0.069432 0.034566 -0.049071 0.285158 0.123014 0.197900
polarizability: 1.18079032e+02 -1.83318377e+00 1.04398303e+02 6.11484112e+00 4.06604158e+00 7.86724982e+01
1716.lowfreq: -0.0007 -0.0001 0.0004 2.0685 5.8125 8.8560 19.5794 37.6047 75.0682
frequency: 17.5304 37.4625 75.0664 78.2493 93.9996 128.6178 151.4600 160.2124 176.6730 196.4193 227.4702 259.5053 289.4238 335.0748 387.7095 403.7319 489.0406 522.5594 563.7224 616.0363 687.1835 731.5479 750.2123 824.9492 846.1678 894.4479 944.1405 968.8308 975.8406 1042.3258 1074.2719 1102.5252 1109.6632 1118.5172 1134.7868 1141.7251 1147.5002 1179.1010 1228.6776 1262.7355 1285.7008 1291.3652 1315.2173 1351.0113 1368.8827 1390.4077 1401.5613 1415.1238 1443.4351 1454.1188 1458.8115 1463.5131 1471.0716 1474.1978 1477.0179 1479.0700 1485.9106 1500.7914 1623.0576 2958.9207 2972.0784 2973.1435 2974.5063 2975.0670 2988.8822 3004.3182 3041.9932 3068.4692 3069.3845 3070.8324 3072.5424 3075.0020 3110.3730 3120.3275 3552.4462
redmass: 3.5656 3.2153 2.0571 2.0680 3.8897 3.1583 1.3152 1.4784 1.5336 2.9993 1.1492 2.3726 3.3779 3.3015 3.3149 3.9243 4.2301 2.9617 4.0119 1.1248 7.7881 1.7994 1.7246 1.9299 1.9041 2.0007 4.1371 2.1450 1.7813 3.9151 3.0505 1.5416 1.2570 2.0887 1.7541 1.9808 1.4993 2.1333 1.3534 1.4435 1.5816 1.4386 1.2750 1.4911 1.3360 1.2125 1.1430 1.1389 1.0573 1.1126 1.0846 1.0471 1.1197 1.0604 1.0430 1.1087 1.0749 1.6834 8.0323 1.0588 1.0363 1.0411 1.0345 1.0515 1.0656 1.0977 1.1007 1.0976 1.0998 1.1004 1.0999 1.1054 1.1033 1.0989 1.0765
irintensity: 1.1809 1.3429 1.2695 0.4351 10.3880 0.9450 0.6265 0.9597 3.6906 0.9111 0.5725 12.6252 10.3520 6.2992 20.7142 17.7020 1.2609 0.7496 13.3643 117.7122 28.2631 18.2638 7.5227 0.6145 1.4993 12.8197 38.7012 1.5060 20.0964 3.9524 3.1649 66.6775 0.1236 4.1164 3.1310 4.2995 2.1695 43.0994 4.5142 3.4852 37.1570 23.8145 52.3141 3.5273 6.1864 9.8556 16.3473 5.5046 5.1591 34.6012 5.5855 25.3517 49.8013 1.9794 9.2568 59.4829 14.4710 307.6585 221.4374 27.8046 70.6828 19.2018 71.1055 40.1980 40.3985 5.6146 51.9540 28.8218 34.4830 47.4532 68.6779 41.8954 22.0133 5.4620 31.3987
temp: 298.150 k
press: 1.00000 atm
elementType: 8 8 7 7 6 6 6 6 6 6 6 1 1 1 1 1 1 1 1 1 1 1 1 1 1 1 1
symmnumber: 1
zpe: 607425.8 jmol-1
zpe.correction: 0.231356 hartree
zpe.thermalcorrener: 0.245584 hartree
zpe.thermalcorrenthalpy: 0.246528 hartree
zpe.thermalcorrgfe: 0.188653 hartree
zpe.sumelectzpe: -535.337692 hartree
zpe.sumelectthermal: -535.323465 hartree
zpe.sumelectthermalent: -535.322520 hartree
zpe.sumelectthermalfe: -535.380396 hartree
dipole: 0.2876 3.7674 0.9977
dipole: 3.9079
quadrupole: -60.4919 -69.7755 -69.6368
quadrupole: -5.5314 2.8757 -3.8673
quadrupole: 6.1428 -3.1407 -3.0021 -5.5314 2.8757 -3.8673
hfenergy: -535.5690483 hartree
pointgroup: C01 [X(C7H16N2O2)]
dipole: 0.11785 1.4846793 0.3817113 debye
polarizability: 117.6722954|-2.0154063|104.5113647|7.2458781|3.7023192|78.9661731 unknown
InChI: InChI=1S/C7H16N2O2/c1-4-5-6-8-7(10)9(2)11-3/h8H,4-6H2,1-3H3
charge 0 multiplicity 1
27 atoms
O  -1.913688 1.2744 0.551766
O  -0.982556 -1.973173 -0.734703
N  0.112888 -0.395581 0.623355
N  -1.970027 0.120169 -0.376548
C  2.509407 -0.76207 -0.082686
C  1.327346 -1.201312 0.814339
C  3.00898 0.67327 0.197253
C  4.198179 1.076498 -0.701063
C  -0.928233 -0.83717 -0.168809
C  -3.347856 -0.348094 -0.597125
C  -1.785846 2.516122 -0.244021
H  2.203345 -0.853253 -1.143273
H  3.343752 -1.477202 0.071517
H  1.622636 -1.144519 1.880628
H  1.058821 -2.248292 0.588695
H  3.304233 0.757374 1.26406
H  2.173953 1.38691 0.042654
H  -0.012831 0.497936 1.10151
H  3.919518 1.026424 -1.770396
H  4.53847 2.106388 -0.486842
H  5.058107 0.397466 -0.548017
H  -3.280156 -1.277658 -1.183767
H  -3.914789 0.404708 -1.17044
H  -3.868725 -0.554417 0.358412
H  -2.677522 2.668928 -0.878951
H  -0.879097 2.487006 -0.874659
H  -1.716909 3.322042 0.505513
