program: Gaussian 09
title: 000148625
version: EM64L-G09RevD.01
frameworkgroup: C1[X(C8H16N2O3)]
method: RPBEPBE
basis: SDD
operation: Freq
keyword: #p
keyword: freq=noraman
keyword: PBEPBE/SDD
title: #p freq=noraman PBEPBE/SDD
converged: YES YES NO NO
title: Mulliken charges:
elementType: O O O N N C C C C C C C C H H H H H H H H H H H H H H H H
charge: -0.181113 -0.264564 -0.388101 -0.449388 -0.318733 0.157869 -0.391322 -0.365750 -0.701528 -0.722263 0.204617 -0.690570 0.303659 0.213427 0.163500 0.221104 0.206073 0.240657 0.199587 0.222162 0.237042 0.200707 0.235308 0.200874 0.213876 0.225141 0.316459 0.325238 0.386035
chargesum: 0.00000
title: Mulliken charges with hydrogens summed into heavy atoms:
elementType: O O O N N C C C C C C C C
charge: -0.181113 -0.264564 -0.002066 -0.132929 0.006505 0.157869 -0.014396 0.061427 -0.039123 -0.049206 0.204617 -0.050679 0.303659
polarizability: 1.37120033e+02 7.11370018e+00 1.14674768e+02 -9.93863130e-02 7.96881301e+00 9.13253425e+01
1716.lowfreq: -13.7218 -0.0008 -0.0005 -0.0004 2.5259 5.8543 19.3144 36.6525 56.1142
frequency: 19.0921 36.4082 56.0326 76.1584 89.2379 113.2775 157.1328 180.0943 193.2267 216.3328 230.6344 249.8890 263.1590 283.9092 304.3364 322.4269 353.0535 357.7247 403.5894 423.5341 433.4682 470.2194 566.2032 575.2447 660.6461 706.9144 725.9745 738.1094 822.5925 862.0992 880.8149 905.5802 939.8409 950.2173 960.1249 997.4393 1019.4100 1050.6127 1057.4347 1101.1589 1123.1040 1170.0433 1204.1201 1210.8756 1216.3581 1268.3097 1289.4304 1300.9944 1325.5074 1350.3222 1381.2259 1393.6881 1399.9993 1414.3148 1452.6399 1464.1326 1471.8422 1473.8591 1477.1816 1479.7280 1483.3649 1485.6816 1491.6959 1612.0642 1655.1191 2933.2006 2973.2374 2975.7382 2978.5183 2994.4819 3003.8769 3037.1590 3069.1241 3070.5741 3077.1549 3083.7367 3092.4119 3105.3394 3277.5663 3523.7538 3558.1061
redmass: 5.5870 5.4456 5.8832 2.0431 2.3128 4.9436 2.1953 1.3556 3.8169 1.2455 1.2484 3.7870 2.1679 4.4526 2.9600 2.7100 3.3465 1.3620 2.2606 1.5530 2.8165 3.0684 1.3642 2.3691 5.7372 4.7265 4.0884 1.3064 2.4124 1.5445 2.7853 2.2370 1.4849 3.4059 2.2046 1.4239 4.2295 2.5116 1.4708 2.1406 2.5770 2.6660 1.7808 2.2698 1.9865 1.5822 1.3601 1.2192 1.9601 1.4890 1.1958 1.2103 1.2000 1.9026 1.0545 1.0538 1.0817 1.0693 1.0985 1.0754 1.2364 1.1074 1.1069 4.5916 9.6952 1.0660 1.0360 1.0354 1.0643 1.0374 1.0895 1.0994 1.1003 1.0997 1.0992 1.1004 1.0988 1.0990 1.0643 1.0763 1.0810
irintensity: 5.1462 0.8755 5.8718 0.2007 0.4251 1.2011 0.1762 1.0198 8.6401 2.5838 0.0789 5.2480 6.5408 16.8546 13.9443 0.8506 13.5319 206.9121 96.6479 53.8318 3.4933 5.9253 70.4774 38.4642 22.8709 16.3296 15.3566 2.7463 0.9426 5.1963 32.6062 15.0472 7.1553 20.4564 18.7440 0.6185 11.9526 3.2103 5.2773 3.6850 195.1540 3.2557 14.7617 1.1696 9.0933 2.7351 1.3415 0.9699 215.1745 1.5813 16.7176 8.2921 17.9321 565.8427 2.7928 8.6211 9.6312 7.3945 2.3512 23.0369 42.7701 39.7005 39.5130 42.9727 245.8916 44.3089 38.4193 26.3372 19.9696 18.1912 29.2409 13.3353 8.6970 118.4451 39.1500 10.9715 35.3675 26.8621 25.1265 18.1363 44.1195
temp: 298.150 k
press: 1.00000 atm
elementType: 8 8 8 7 7 6 6 6 6 6 6 6 6 1 1 1 1 1 1 1 1 1 1 1 1 1 1 1 1
symmnumber: 1
zpe: 628655.2 jmol-1
zpe.correction: 0.239442 hartree
zpe.thermalcorrener: 0.255544 hartree
zpe.thermalcorrenthalpy: 0.256488 hartree
zpe.thermalcorrgfe: 0.194929 hartree
zpe.sumelectzpe: -648.541229 hartree
zpe.sumelectthermal: -648.525127 hartree
zpe.sumelectthermalent: -648.524183 hartree
zpe.sumelectthermalfe: -648.585742 hartree
dipole: -3.9139 3.4315 2.9913
dipole: 6.0035
quadrupole: -85.3281 -81.3734 -82.9330
quadrupole: 3.1881 -0.9379 -5.2585
quadrupole: -2.1166 1.8381 0.2785 3.1881 -0.9379 -5.2585
hfenergy: -648.7806715 hartree
pointgroup: C01 [X(C8H16N2O3)]
dipole: -1.5367196 1.4182959 1.0980739 debye
polarizability: 137.4731235|6.1671472|114.5658453|1.5968535|7.7335951|91.081175 unknown
InChI: InChI=1S/C8H16N2O3/c1-4-5-8(2,3)6(11)9-7(12)10-13/h9-10,13H,4-5H2,1-3H3
charge 0 multiplicity 1
29 atoms
O  0.085449 -1.479759 -1.284594
O  2.866209 -1.195569 -0.124348
O  4.280379 1.000704 0.428078
N  0.796169 -0.136207 0.492431
N  2.844907 0.989582 0.608761
C  -1.60442 -0.817528 0.413522
C  -2.061739 0.656357 0.680941
C  -2.065121 1.592211 -0.549469
C  -1.551746 -1.5902 1.767061
C  -2.591379 -1.531836 -0.540761
C  -0.188943 -0.860893 -0.229816
C  -2.48605 3.032717 -0.186212
C  2.196818 -0.193923 0.260837
H  -3.085063 0.60984 1.106008
H  -1.437715 1.113057 1.482054
H  -2.754224 1.192389 -1.316848
H  -1.058842 1.604062 -1.014672
H  -1.194227 -2.624528 1.617839
H  -0.887449 -1.103258 2.5054
H  -2.565697 -1.638083 2.204898
H  -2.30934 -2.590186 -0.669775
H  -3.614519 -1.484509 -0.124532
H  -2.592562 -1.076315 -1.544542
H  -1.794034 3.480514 0.552683
H  -3.500858 3.051081 0.254078
H  -2.494518 3.685224 -1.077907
H  0.481896 0.433272 1.281995
H  2.457731 1.926668 0.480538
H  4.449891 0.070814 0.068151
