program: Gaussian 09
title: 000009881
version: EM64L-G09RevD.01
frameworkgroup: C1[X(C3H3F2NO4)]
method: RPBEPBE
basis: SDD
operation: Freq
keyword: #p
keyword: freq=noraman
keyword: PBEPBE/SDD
title: #p freq=noraman PBEPBE/SDD
converged: YES YES NO NO
title: Mulliken charges:
elementType: F F O O O O N C C C H H H
charge: -0.121898 -0.117656 -0.247727 -0.164460 -0.125741 -0.161514 0.108459 0.308460 0.240780 -0.486031 0.259002 0.252965 0.255361
chargesum: 0.00000
title: Mulliken charges with hydrogens summed into heavy atoms:
elementType: F F O O O O N C C C
charge: -0.121898 -0.117656 -0.247727 -0.164460 -0.125741 -0.161514 0.108459 0.308460 0.240780 0.281298
polarizability: 6.25446707e+01 3.11367191e+00 5.33411571e+01 -6.54798361e+00 -4.33851423e+00 5.24850534e+01
1716.lowfreq: -0.0011 0.0003 0.0011 1.4487 5.4145 10.8775 33.2721 60.8316 71.8398
frequency: 33.2490 60.8149 71.8304 101.3971 150.6389 210.3118 234.4337 280.6627 312.6971 338.2531 388.8510 426.1078 538.7085 637.2738 696.7034 722.0375 756.9348 879.6411 916.4754 1073.1988 1086.6784 1115.7382 1155.4851 1187.0312 1227.4571 1424.5090 1452.2146 1455.8559 1458.5720 1677.6355 3017.0267 3126.1346 3171.6197
redmass: 9.3019 4.4246 1.2527 5.0552 5.5890 6.8549 16.4813 5.6520 15.3365 12.1727 13.2901 11.9663 14.0251 13.1558 12.6400 10.7286 8.6269 10.2369 10.4912 10.5043 9.7056 1.2630 1.4710 13.5516 10.6555 1.1732 13.9315 1.0492 1.0532 11.0776 1.0292 1.1059 1.1056
irintensity: 0.0893 1.6023 0.7602 1.6631 0.9041 4.4705 2.1354 19.9039 3.6718 1.5847 4.7561 3.8029 11.3907 16.4360 11.2595 45.5452 8.5643 10.8824 23.0472 94.5120 315.7198 0.3784 22.8565 96.9836 49.9791 13.0199 184.4003 17.8854 9.9811 212.4770 15.3087 14.3220 6.6941
temp: 298.150 k
press: 1.00000 atm
elementType: 9 9 8 8 8 8 7 6 6 6 1 1 1
symmnumber: 1
zpe: 187731.0 jmol-1
zpe.correction: 0.071503 hartree
zpe.thermalcorrener: 0.081978 hartree
zpe.thermalcorrenthalpy: 0.082923 hartree
zpe.thermalcorrgfe: 0.033900 hartree
zpe.sumelectzpe: -670.554156 hartree
zpe.sumelectthermal: -670.543680 hartree
zpe.sumelectthermalent: -670.542736 hartree
zpe.sumelectthermalfe: -670.591759 hartree
dipole: 3.7908 -1.1257 1.0141
dipole: 4.0824
quadrupole: -48.3225 -59.3920 -59.6565
quadrupole: -7.6124 3.2823 1.1912
quadrupole: 7.4678 -3.6017 -3.8661 -7.6124 3.2823 1.1912
hfenergy: -670.6256587 hartree
pointgroup: C01[X(C3H3F2N1O4)]
dipole: 1.5503538 0.4153761 0.0595612 debye
dipolederiv: -0.4378193 -0.25786 -0.0151538 -0.1808212 -0.5764419 -0.0472039 -0.0073215 -0.051535 -0.2727335 -0.3191156 -0.0005568 -0.0152745 -0.0458072 -0.2756731 0.1429098 0.0569296 0.1082123 -0.7339566 -1.0063677 -0.3466785 -0.1586068 -0.5119212 -0.8652418 -0.0818266 -0.1787802 -0.075061 -0.2864 -0.5120276 0.2630858 -0.0315165 -0.1151108 -0.8633111 -0.0546628 -0.0839613 0.1227222 -0.251504 -0.3975752 0.2704128 -0.1359171 0.3864073 -0.5041695 0.1653371 -0.0281903 0.0356629 -0.4404903 -0.3243678 0.1465203 0.0190777 0.1940989 -0.3441406 0.0178316 -0.0394579 0.123978 -0.7007077 0.4840867 -0.4577839 0.1220664 -0.7062225 0.6801586 -0.1949527 -0.016611 -0.147558 0.9909839 0.8224555 0.3625907 0.0104579 0.4003338 0.9709509 -0.0467691 -0.0313062 -0.0354398 1.1783642 1.0074261 -0.0425245 0.1016863 0.4664743 1.4489717 0.0692052 0.2299566 -0.1026979 0.1444687 0.632212 0.1532338 0.086044 0.0979656 0.2411465 0.0305025 0.1031551 0.0556481 0.2901851 0.0126264 -0.0536721 0.0183751 0.007912 0.0802816 0.0891277 -0.0355601 0.0408158 -0.0471393 0.0634032 -0.0265106 -0.0173234 -0.06923 -0.0537953 -0.0110224 -0.0194791 0.0013116 0.1256234 -0.0249366 -0.0102571 0.0160846 0.075921 0.061264 -0.0784763 0.0506262 -0.0760592 0.003306 unknown
polarizability: 60.0667496|-6.0996083|58.2259176|5.268795|-3.0457306|50.0782139 unknown
InChI: InChI=1S/C3H3F2NO4/c1-10-2(7)3(4,5)6(8)9/h1H3
charge 0 multiplicity 1
13 atoms
F  -1.248981 -1.513232 -0.607076
F  -0.531005 0.242166 -1.860067
O  1.548773 0.644672 0.045556
O  1.413925 -1.695389 0.147519
O  -1.995882 1.581327 -0.117009
O  -1.131268 0.38513 1.639021
N  -1.293563 0.658557 0.398853
C  -0.512384 -0.323382 -0.580606
C  0.931657 -0.57524 -0.076418
C  2.959126 0.626542 0.527064
H  3.001254 0.159567 1.524313
H  3.249654 1.683914 0.5650
H  3.584393 0.060867 -0.182451
