program: Gaussian 09
title: 000148601
version: EM64L-G09RevD.01
frameworkgroup: C1[X(C16H16O6)]
method: RPBEPBE
basis: SDD
operation: Freq
keyword: #pfreq=noraman
keyword: PBEPBE/SDD
title: #p freq=noraman PBEPBE/SDD
converged: YES YES NO NO
title: Mulliken charges:
elementType: O O O O O O C C C C C C C C C C C C C C C C H H H H H H H H H H H H H H H H
charge: -0.307643 -0.419238 -0.220412 -0.282392 -0.433355 -0.255420 -0.037078 -0.299553 0.337236 0.363842 0.474490 0.080915 -0.029685 -0.566970 -0.804827 -0.429863 0.153711 0.109055 -0.204340 -0.342405 -0.530830 -0.503897 0.250815 0.272512 0.222485 0.257969 0.258080 0.253781 0.353427 0.227108 0.251131 0.235640 0.255121 0.231138 0.376196 0.211598 0.268384 0.223277
chargesum: 0.00000
title: Mulliken charges with hydrogens summed into heavy atoms:
elementType: O O O O O O C C C C C C C C C C C C C C C C
charge: -0.307643 -0.065811 -0.220412 -0.282392 -0.057159 -0.255420 -0.037078 -0.048738 0.337236 0.363842 0.474490 0.080915 -0.029685 -0.294458 -0.066293 -0.176082 0.153711 0.109055 0.022767 -0.091275 0.191069 0.199362
polarizability: 2.95398977e+02 4.51946826e+00 1.58345153e+02 -1.95661462e+00 2.39247870e+00 1.53603014e+02
1716.lowfreq: -5.1816 0.0004 0.0005 0.0008 0.5914 5.9430 24.5472 30.6535 44.6953
frequency: 24.3475 30.6389 44.6743 64.2628 74.1967 95.9288 104.0190 147.1857 152.0230 153.8325 169.7952 182.8510 197.6667 211.1853 235.5705 239.1796 248.2530 275.8761 291.8703 315.6679 320.6408 329.1108 337.8124 361.9423 390.2893 401.8663 434.0880 447.6664 493.2288 499.2699 531.1650 542.8696 551.6226 561.8886 574.5264 611.2676 661.7674 673.5397 697.0997 712.0298 738.5225 749.7805 769.4075 787.8562 832.9279 851.9673 872.7062 884.6193 903.2297 952.7632 957.3742 960.1287 1008.2706 1021.0238 1029.9195 1034.4811 1046.7103 1082.4548 1105.2222 1111.8440 1139.7355 1147.2666 1154.6347 1169.9380 1181.9383 1182.6046 1188.9482 1205.9262 1222.0333 1271.1925 1289.3092 1313.9946 1321.0017 1354.4824 1375.5994 1398.2995 1410.0313 1429.3136 1433.1921 1448.6521 1452.9423 1461.5585 1465.9041 1468.0070 1469.0082 1471.8610 1487.0133 1543.7432 1597.6970 1618.8358 1633.1039 1647.1662 2965.6164 2980.0111 2982.1060 2991.9346 3055.5387 3076.7109 3100.6899 3104.4172 3137.9136 3143.9444 3145.8691 3164.5931 3169.4154 3177.0055 3546.9320 3556.8584
redmass: 2.9620 4.2004 5.7605 4.4166 2.6668 3.1796 1.2070 2.8656 3.1974 2.1416 2.6561 4.4266 4.4287 4.4795 1.6151 3.5841 3.2702 4.1893 4.5812 1.2991 4.9310 3.6679 5.0361 7.4739 5.4843 1.1127 7.0521 5.1862 7.6736 5.5342 4.2878 4.7933 4.0257 6.0601 6.9073 6.7199 5.9958 6.2631 4.8497 4.6203 3.6145 2.6938 2.7733 2.3069 6.0570 1.7222 7.3047 1.4472 7.8046 1.4937 3.8193 4.2931 3.6068 3.5160 1.6404 4.0208 2.3663 2.4795 1.2381 1.2662 1.7062 1.5637 1.3913 1.1377 2.3070 2.6347 1.5100 3.3665 1.5446 3.1841 1.7436 2.8155 2.4118 2.6543 1.6255 1.2334 5.5848 1.1675 1.2169 1.0671 1.0894 3.3851 1.0626 1.0492 1.0593 1.0896 3.4796 8.6040 7.6458 7.4647 8.8157 8.0429 1.0841 1.0318 1.0380 1.0322 1.0950 1.1046 1.1006 1.0991 1.1052 1.0866 1.1013 1.0925 1.0914 1.0988 1.0662 1.0658
irintensity: 2.2859 1.5787 7.8750 1.2472 0.7141 3.5724 0.6717 0.8456 1.0725 3.6552 1.3993 2.2909 2.0431 0.3366 0.2309 0.8011 4.9933 8.4632 10.4909 125.9185 3.6685 25.4952 16.4795 6.6271 4.8596 133.5449 1.4849 1.1385 1.3172 2.8291 2.1710 2.7985 2.9901 2.1343 8.4922 2.3029 10.5315 12.8842 1.7070 11.7692 18.0303 63.0380 14.9264 55.8198 52.8002 37.2013 132.9569 2.4713 15.8870 13.7929 14.6950 74.4578 37.9461 142.8087 20.3528 33.4647 13.7063 4.0732 3.4771 0.1019 26.4983 49.4243 8.1647 66.8798 117.7714 309.2896 67.4029 76.6598 34.2134 10.4724 7.1029 96.1455 6.1398 63.1724 1.5683 29.2937 29.6179 29.7997 12.2248 22.1733 7.2538 142.7221 36.2413 15.6966 18.2803 6.7576 32.6494 198.1357 297.2120 23.5965 45.4549 67.8871 26.8748 42.7505 15.3749 75.1694 15.9119 25.9409 46.2678 7.5903 11.7310 5.7863 10.7589 6.2685 3.6927 17.0775 5.1968 51.9079
temp: 298.150 k
press: 1.00000 atm
elementType: 8 8 8 8 8 8 6 6 6 6 6 6 6 6 6 6 6 6 6 6 6 6 1 1 1 1 1 1 1 1 1 1 1 1 1 1 1 1
symmnumber: 1
zpe: 755731.4 jmol-1
zpe.correction: 0.287843 hartree
zpe.thermalcorrener: 0.309410 hartree
zpe.thermalcorrenthalpy: 0.310354 hartree
zpe.thermalcorrgfe: 0.237202 hartree
zpe.sumelectzpe: -1068.959272 hartree
zpe.sumelectthermal: -1068.937705 hartree
zpe.sumelectthermalent: -1068.936761 hartree
zpe.sumelectthermalfe: -1069.009913 hartree
dipole: 0.2178 0.7867 2.2251
dipole: 2.3701
quadrupole: -138.7917 -116.7972 -123.5751
quadrupole: -7.3080 2.5311 -5.8242
quadrupole: -12.4037 9.5908 2.8129 -7.3080 2.5311 -5.8242
hfenergy: -1069.2471149 hartree
pointgroup: C01 [X(C16H16O6)]
dipole: -0.0737989 -0.1494122 0.917472 debye
polarizability: 295.5370576|-1.3136106|157.2325348|-1.8349268|-3.0787981|154.5775526 unknown
InChI: InChI=1S/C16H16O6/c1-8-13(21-3)11(18)7-12(20-2)16(8)15(19)9-5-4-6-10(17)14(9)22-16/h4-7,15,17,19H,1-3H3
charge 0 multiplicity 1
38 atoms
O  0.830639 0.336105 -1.219493
O  0.32259 -0.474483 2.313277
O  0.378201 -2.141022 -0.173502
O  -3.577319 1.846188 -0.568333
O  3.358717 0.306635 -2.674394
O  -4.299661 -0.926486 -0.053436
C  -0.217625 0.178679 -0.133622
C  0.569249 0.494562 1.251189
C  -1.310601 1.193794 -0.372045
C  2.020873 0.478537 0.82567
C  -0.681629 -1.267663 -0.136526
C  2.083864 0.407582 -0.571631
C  -2.640825 0.840105 -0.311357
C  -2.009288 -1.599793 -0.057376
C  -0.876846 2.610012 -0.66661
C  3.201871 0.557663 1.586888
C  3.301976 0.398658 -1.276561
C  -3.069457 -0.586676 -0.115008
C  4.439504 0.556587 0.894068
C  4.492133 0.480872 -0.519991
C  0.093893 -3.577336 -0.03622
C  -4.902453 1.834345 0.09608
H  0.2585 1.501532 1.598875
H  -2.355998 -2.634704 0.011358
H  0.070081 2.86958 -0.159703
H  -1.664416 3.324596 -0.37878
H  -0.69575 2.735849 -1.751208
H  3.161997 0.597082 2.679073
H  -0.567833 -0.301194 2.714057
H  5.377107 0.610173 1.456905
H  5.448787 0.474362 -1.051356
H  -0.398702 -3.779342 0.932395
H  1.077073 -4.065732 -0.073021
H  -0.542073 -3.929857 -0.869429
H  2.442395 0.207391 -3.039982
H  -4.798359 1.666204 1.183586
H  -5.548388 1.054777 -0.331783
H  -5.304529 2.841817 -0.095454
