program: Gaussian 09
title: 000148574
version: EM64L-G09RevD.01
frameworkgroup: C1[X(C10H15NO2)]
method: RPBEPBE
basis: SDD
operation: Freq
keyword: #p
keyword: freq=noraman
keyword: PBEPBE/SDD
title: #p freq=noraman PBEPBE/SDD
converged: YES YES NO NO
title: Mulliken charges:
elementType: O O N C C C C C C C C C C H H H H H H H H H H H H H H H
charge: -0.424234 -0.433737 -0.546960 -0.640703 -0.094299 0.462488 0.061305 -0.547132 -0.697656 0.366902 0.107157 -0.532933 -0.857276 0.227183 0.196643 0.223517 0.255759 0.240625 0.190805 0.240176 0.251431 0.259042 0.260950 0.251775 0.231116 0.231867 0.353225 0.362966
chargesum: 0.00000
title: Mulliken charges with hydrogens summed into heavy atoms:
elementType: O O N C C C C C C C C C C
charge: -0.071010 -0.070771 -0.026969 -0.216878 0.129218 0.462488 0.061305 -0.291372 -0.026049 0.366902 0.107157 -0.281502 -0.142519
polarizability: 1.71540780e+02 4.89355855e+00 1.23177742e+02 -1.20403659e+01 5.82848236e+00 7.96088750e+01
1716.lowfreq: -11.0581 -9.9836 -0.0008 -0.0006 -0.0002 7.2483 42.4235 57.5203 64.7028
frequency: 41.9432 57.4435 64.6096 132.1168 143.4313 190.4569 210.5182 234.5650 243.7465 267.2049 276.2647 281.1187 291.7904 312.8352 335.0982 377.3039 412.6758 431.6019 451.5012 465.5832 523.7596 563.4832 580.6929 628.5812 692.3068 723.0502 741.9551 812.1223 827.2635 870.4362 883.1071 890.1304 936.7710 983.0082 992.6663 1041.8852 1068.3491 1082.2311 1116.3368 1135.1631 1154.1744 1167.6108 1185.9612 1216.0833 1233.6969 1262.7174 1285.4854 1325.8051 1337.5622 1359.3983 1385.8681 1388.8950 1394.8844 1442.2676 1468.4839 1471.6394 1476.4166 1477.7569 1487.2744 1498.1525 1585.0915 1636.8819 1652.5438 2928.4955 2953.7906 2970.1831 2977.7439 3021.5891 3027.0845 3073.9766 3089.1216 3107.1926 3149.6619 3153.9661 3440.5771 3569.6966 3585.1496 3587.6260
redmass: 2.9250 3.7787 3.7288 4.4324 1.1008 3.5522 1.1280 1.0871 1.4446 1.8563 2.9096 3.3244 1.2992 2.7327 4.0147 3.0977 2.8877 2.8521 2.5627 3.9249 3.2319 2.8448 1.7604 4.9382 4.9155 4.1674 4.8980 2.9418 2.5212 1.5416 1.5310 1.4810 1.8438 1.4870 1.4074 1.4978 2.1943 2.8379 2.0312 1.4290 1.3489 2.1076 2.1392 1.9015 1.4490 1.3565 1.4061 2.0176 1.7790 1.4551 1.8866 2.0280 1.2360 2.2964 1.0651 1.0498 1.0474 1.0808 1.4229 3.4762 6.7503 1.0974 6.9887 1.0681 1.0400 1.0664 1.0581 1.0979 1.0929 1.0930 1.0945 1.1007 1.0915 1.0921 1.0444 1.0976 1.0655 1.0654
irintensity: 0.4858 0.1303 0.0766 0.2890 0.0447 1.1073 0.3739 57.1961 33.4150 101.9623 24.9816 10.0925 83.1292 7.7164 12.1045 3.1936 9.6775 2.5482 2.4743 5.5616 22.4142 22.8844 287.9802 8.0953 15.4973 1.0433 9.4384 40.9379 4.5076 3.6147 29.6749 16.9332 2.4105 34.4105 9.8718 6.7719 40.6469 11.1019 27.2736 133.7165 11.6037 94.7885 22.9289 144.3128 14.8911 1.9052 6.2224 7.0042 5.9412 2.1994 24.8225 70.1139 13.3340 3.9503 6.7686 5.8997 10.5951 13.4486 8.3321 131.7147 0.4601 46.5986 0.3869 56.7785 42.2768 3.4803 34.9256 24.2744 28.6010 37.6195 12.8110 26.0529 9.2335 2.2750 2.3608 0.1340 41.0321 11.4137
temp: 298.150 k
press: 1.00000 atm
elementType: 8 8 7 6 6 6 6 6 6 6 6 6 6 1 1 1 1 1 1 1 1 1 1 1 1 1 1 1
symmnumber: 1
zpe: 609172.0 jmol-1
zpe.correction: 0.232021 hartree
zpe.thermalcorrener: 0.246584 hartree
zpe.thermalcorrenthalpy: 0.247528 hartree
zpe.thermalcorrgfe: 0.191169 hartree
zpe.sumelectzpe: -594.254016 hartree
zpe.sumelectthermal: -594.239453 hartree
zpe.sumelectthermalent: -594.238509 hartree
zpe.sumelectthermalfe: -594.294868 hartree
dipole: -0.4947 -0.1816 -0.9469
dipole: 1.0837
quadrupole: -63.7045 -83.5254 -81.1001
quadrupole: -0.3983 -11.1242 -1.2738
quadrupole: 12.4055 -7.4154 -4.9901 -0.3983 -11.1242 -1.2738
hfenergy: -594.4860373 hartree
pointgroup: C01 [X(C10H15N1O2)]
dipole: -0.1980944 -0.0293672 -0.3763824 debye
polarizability: 170.7539963|8.2733259|121.456324|-12.7140657|10.7325292|82.1170762 unknown
InChI: InChI=1S/C10H15NO2/c1-6-3-10(13)8(4-7(2)11)5-9(6)12/h3,5,7,12-13H,4,11H2,1-2H3
charge 0 multiplicity 1
28 atoms
O  0.571295 2.462986 0.271296
O  -2.542605 -2.153874 -0.559742
N  4.280683 0.018821 -0.069139
C  1.87673 0.063844 -0.91132
C  2.859278 -0.11784 0.309447
C  0.40474 0.112515 -0.53603
C  -0.170028 1.278891 0.043853
C  -0.439139 -1.007923 -0.719496
C  2.65443 -1.482601 0.992489
C  -2.36501 0.188724 0.251436
C  -1.793405 -0.976387 -0.332878
C  -1.526394 1.311663 0.427345
C  -3.826615 0.21582 0.663058
H  2.055744 -0.772394 -1.614231
H  2.180301 0.985408 -1.458121
H  2.63844 0.674441 1.054187
H  -0.047778 -1.926585 -1.168969
H  3.313281 -1.565133 1.873191
H  2.905248 -2.307004 0.294834
H  1.606861 -1.615001 1.310361
H  -1.919982 2.234311 0.866021
H  4.533331 0.918634 -0.491486
H  4.640146 -0.773691 -0.612554
H  -4.093772 1.196962 1.088197
H  -4.505701 0.040931 -0.196299
H  -4.057085 -0.544554 1.436941
H  1.489041 2.36886 -0.084399
H  -3.476834 -2.035625 -0.257688
