program: Gaussian 09
title: 000148507
version: EM64L-G09RevD.01
frameworkgroup: C1[X(C15H10N2O)]
method: RPBEPBE
basis: SDD
operation: Freq
keyword: #p
keyword: freq=noraman
keyword: PBEPBE/SDD
title: #p freq=noraman PBEPBE/SDD
converged: NO NO NO NO
title: Mulliken charges:
elementType: O N N C C C C C C C C C C C C C C C H H H H H H H H H H
charge: -0.297788 -0.474754 -0.028039 0.100702 0.240039 0.186157 0.224851 -0.071462 -0.312544 -0.392197 -0.373195 0.324135 -0.396282 -0.255577 -0.208917 -0.380048 -0.257084 -0.174896 0.348918 0.234615 0.237351 0.238078 0.238714 0.225894 0.225232 0.283948 0.255094 0.259057
chargesum: 0.00000
title: Mulliken charges with hydrogens summed into heavy atoms:
elementType: O N N C C C C C C C C C C C C C C C
charge: -0.297788 -0.125835 -0.028039 0.100702 0.240039 0.186157 0.224851 -0.071462 -0.077929 -0.154846 -0.135117 0.324135 -0.157568 -0.029684 0.016315 -0.096100 -0.001991 0.084161
polarizability: 3.08628214e+02 -7.72443374e-01 2.12117809e+02 -2.97521386e-04 -3.88943857e-03 6.83207888e+01
1716.lowfreq: -4.8272 -0.0010 0.0004 0.0010 4.3187 9.4216 59.8057 73.5587 95.8093
frequency: 59.7836 73.5224 95.8093 118.0756 154.3417 218.3374 249.9829 294.5214 301.2392 338.1173 348.9228 437.3313 468.0623 528.9351 557.2086 568.0716 575.0882 583.7538 609.5155 621.6385 626.1580 670.4662 687.1471 712.4457 754.8138 760.4708 787.0419 793.2629 827.8403 836.6490 839.6920 862.6350 865.9136 870.7083 889.5161 894.6593 942.8583 945.9658 978.7609 987.4903 1009.6143 1019.5358 1044.6476 1054.5347 1107.9074 1127.0341 1141.0922 1170.0757 1199.1847 1218.2381 1242.0185 1247.2493 1308.1412 1320.0937 1329.5760 1335.0856 1360.7263 1408.7440 1419.0577 1433.9639 1460.2783 1480.6886 1484.8943 1554.1750 1573.5213 1592.1261 1606.8069 1636.6062 3127.2399 3134.1786 3136.1144 3148.7126 3161.0120 3165.0416 3223.0991 3249.6464 3267.2806 3590.4822
redmass: 4.8669 4.6127 5.5748 5.7555 4.4616 5.1476 5.1263 5.6845 5.9000 4.9482 7.4689 3.0643 6.2445 3.9138 6.0804 5.9561 4.0886 3.1086 5.0133 7.4923 1.1388 4.1883 7.0317 1.2876 1.4610 3.2646 6.4343 3.4994 1.3220 5.3329 1.4680 1.5475 6.3995 6.0723 1.3732 4.6602 1.3969 1.3894 1.3130 2.0758 2.6529 2.4528 2.1928 2.6435 2.1177 1.6064 2.1783 1.1076 1.5856 1.9259 2.5226 1.7671 3.3050 2.2079 2.3427 4.6212 2.4065 3.7646 3.6668 2.3244 4.1300 4.2813 3.6574 6.3788 7.8673 6.6180 8.0100 8.0743 1.0851 1.0879 1.0893 1.0956 1.0975 1.1002 1.0917 1.0986 1.1086 1.0808
irintensity: 1.3577 0.0087 1.1208 0.0018 2.8730 0.4642 0.0415 3.4702 1.5004 1.7569 0.9811 9.4415 2.3796 0.0009 8.7853 0.4631 0.0899 2.8556 0.0411 10.7730 90.2030 4.4080 0.3892 81.9119 119.9374 3.4565 8.7152 10.6657 54.5706 8.3830 14.9306 2.2932 6.5208 4.0541 0.6611 8.4400 2.7468 0.0671 0.0610 32.4163 0.4101 7.4043 5.1637 4.4251 1.8494 6.0972 32.9368 0.3157 4.6676 1.9758 84.4345 2.4440 17.5878 7.3166 41.4973 50.1418 49.8145 5.4513 59.8306 28.0778 19.0622 12.4198 53.3007 32.2763 34.0095 9.7509 12.4844 43.6495 0.3068 13.7090 2.2867 23.6115 28.7581 33.9035 6.5864 1.5379 0.1821 85.3199
temp: 298.150 k
press: 1.00000 atm
elementType: 8 7 7 6 6 6 6 6 6 6 6 6 6 6 6 6 6 6 1 1 1 1 1 1 1 1 1 1
symmnumber: 1
zpe: 555217.9 jmol-1
zpe.correction: 0.211471 hartree
zpe.thermalcorrener: 0.224218 hartree
zpe.thermalcorrenthalpy: 0.225162 hartree
zpe.thermalcorrgfe: 0.171909 hartree
zpe.sumelectzpe: -761.120800 hartree
zpe.sumelectthermal: -761.108053 hartree
zpe.sumelectthermalent: -761.107109 hartree
zpe.sumelectthermalfe: -761.160362 hartree
dipole: -0.5556 -2.3917 0.0001
dipole: 2.4553
quadrupole: -88.3139 -88.7623 -110.7213
quadrupole: -8.2327 0.0000 0.0000
quadrupole: 7.6186 7.1702 -14.7888 -8.2327 0.0000 0.0000
hfenergy: -761.332271 hartree
pointgroup: C01 [X(C15H10N2O1)]
dipole: 0.2349672 -0.9369947 -0.0000458 debye
polarizability: 308.5719278|2.4547251|212.1740945|-0.0003653|0.0038837|68.3207888 unknown
InChI: InChI=1S/C15H10N2O/c1-2-5-12-10(4-1)11-7-8-16-15(14(11)17-12)13-6-3-9-18-13/h1-9,17H
charge 0 multiplicity 1
28 atoms
O  -2.358828 -1.549794 -0.000006
N  0.402922 -1.033622 0.000045
N  -1.704444 2.088337 0.000137
C  -0.103942 0.269819 0.000079
C  0.997154 1.195268 0.000064
C  2.216452 0.395703 0.000033
C  1.806546 -0.985397 0.000026
C  -1.445844 0.740853 0.000112
C  0.707848 2.57854 0.000079
C  3.595265 0.713118 -0.000007
C  2.743904 -2.040841 -0.000018
C  -2.600387 -0.148911 0.000057
C  -0.653624 2.963275 0.000106
C  4.536868 -0.336684 -0.000044
C  4.112646 -1.697116 -0.000033
C  -3.972532 0.074432 0.000014
C  -4.619116 -1.217169 -0.000077
C  -3.619664 -2.177248 -0.000088
H  -0.187524 -1.864202 0.00003
H  1.498279 3.335447 0.000061
H  3.928877 1.756751 -0.00001
H  2.427144 -3.089358 -0.000018
H  -0.930901 4.023073 0.00009
H  5.608296 -0.10909 -0.000073
H  4.865628 -2.493451 -0.000048
H  -4.437921 1.056524 0.00009
H  -5.690135 -1.410811 -0.000097
H  -3.610468 -3.263547 -0.000103
