program: Gaussian 09
title: 000148496
version: EM64L-G09RevD.01
frameworkgroup: C1[X(C13H10N2O)]
method: RPBEPBE
basis: SDD
operation: Freq
keyword: #p
keyword: freq=noraman
keyword: PBEPBE/SDD
title: #p freq=noraman PBEPBE/SDD
converged: NO YES NO NO
title: Mulliken charges:
elementType: O N N C C C C C C C C C C C C C H H H H H H H H H H
charge: -0.269726 -0.498084 -0.698426 0.335217 0.163649 0.250355 0.181907 0.046877 -0.620138 -0.358483 -0.397808 -0.359303 0.567578 -0.471403 -0.212053 -0.265918 0.302144 0.219917 0.275398 0.226342 0.278684 0.222009 0.227436 0.231354 0.308404 0.314074
chargesum: 0.00000
title: Mulliken charges with hydrogens summed into heavy atoms:
elementType: O N N C C C C C C C C C C C C C
charge: -0.269726 -0.195940 -0.075948 0.335217 0.163649 0.250355 0.181907 0.046877 -0.400221 -0.083086 -0.171467 -0.080619 0.567578 -0.249393 0.015382 -0.034564
polarizability: 2.88855200e+02 3.73851352e+00 1.68669473e+02 4.02231377e-03 -9.43775576e-04 6.10640714e+01
1716.lowfreq: -9.7616 -1.6302 -0.0007 -0.0005 -0.0002 4.9423 64.3931 101.6057 135.5687
frequency: 64.3882 101.6056 135.5681 191.3557 210.7500 278.3897 293.4300 299.8232 336.5030 376.0176 397.4267 404.2961 428.9188 445.3730 460.7412 514.5076 535.0412 573.3089 576.8415 593.2999 640.0688 662.7391 667.2379 687.1150 725.7741 766.5444 779.6875 793.0928 831.5909 842.9601 859.1775 870.7293 912.5138 957.1008 964.1194 988.6639 997.9176 1029.7595 1044.6696 1102.8195 1121.5150 1168.6133 1177.7823 1215.2789 1223.2617 1274.8427 1278.8783 1313.2028 1339.5201 1388.8606 1407.1897 1429.6044 1452.0553 1474.2991 1499.3781 1535.5304 1538.5187 1580.1620 1598.0337 1626.9941 1642.6610 1649.2770 3109.6454 3114.5924 3130.5164 3138.0992 3150.8528 3158.1908 3167.9513 3550.2059 3564.2572 3704.0325
redmass: 5.2485 4.5355 5.1895 4.6568 4.9429 4.3093 6.0054 4.6074 5.9968 5.0566 1.0360 1.2613 3.2970 4.4442 2.8180 8.7199 2.9311 1.2878 6.3499 6.9512 4.0651 6.1587 2.9787 6.1019 2.8153 1.4837 6.0448 2.0048 1.8759 2.1698 5.6343 1.6195 6.5312 2.6225 1.3616 1.3381 1.3355 2.0370 1.5332 2.0242 1.7201 1.1368 1.8490 1.4760 1.8646 2.1355 1.6422 2.5759 3.4228 3.1972 5.0154 3.6328 3.2986 2.7589 3.7254 8.7000 4.5312 4.4123 6.8476 5.9145 1.7916 2.2474 1.0911 1.0880 1.0884 1.0885 1.0931 1.0960 1.1000 1.0767 1.0451 1.1040
irintensity: 2.9302 0.0037 0.0033 1.8151 1.2331 0.1696 8.0807 5.5105 1.9823 2.5559 7.0979 292.7287 2.7240 8.8150 1.3256 2.8475 26.3714 46.2025 0.9487 7.0791 7.7613 0.3983 33.0586 0.6039 0.1579 96.0612 0.3367 0.7058 14.0138 94.4156 0.5348 0.8410 14.9483 4.8686 2.7802 0.5239 0.9570 9.5028 0.3195 15.4789 42.3849 10.4041 9.4905 41.1727 4.9590 6.7198 7.6953 79.1757 99.6832 20.8847 9.3720 5.4840 6.0325 133.4331 129.9895 173.0592 41.6829 34.5302 108.5097 272.5988 47.7311 588.3257 17.9205 10.1921 12.6605 12.1184 8.4241 13.9167 32.7103 25.1005 118.5989 23.0122
temp: 298.150 k
press: 1.00000 atm
elementType: 8 7 7 6 6 6 6 6 6 6 6 6 6 6 6 6 1 1 1 1 1 1 1 1 1 1
symmnumber: 1
zpe: 526749.7 jmol-1
zpe.correction: 0.200628 hartree
zpe.thermalcorrener: 0.212766 hartree
zpe.thermalcorrenthalpy: 0.213710 hartree
zpe.thermalcorrgfe: 0.162851 hartree
zpe.sumelectzpe: -685.064785 hartree
zpe.sumelectthermal: -685.052648 hartree
zpe.sumelectthermalent: -685.051703 hartree
zpe.sumelectthermalfe: -685.102563 hartree
dipole: -3.6550 -6.4575 -0.0017
dipole: 7.4201
quadrupole: -59.7903 -88.0780 -99.4855
quadrupole: 0.7132 -0.0100 -0.0196
quadrupole: 22.6609 -5.6267 -17.0342 0.7132 -0.0100 -0.0196
hfenergy: -685.2654132 hartree
pointgroup: C01[X(C13H10N2O1)]
dipole: -1.3938308 -2.5650682 -0.0006581 debye
dipolederiv: -0.6186108 -0.0658483 0.0001139 -0.2537984 -1.2080253 0.001356 -0.0011888 -0.0030418 -0.3571398 -1.5449663 0.0621436 -0.0002176 0.1252213 -0.3607981 -0.0001268 -0.0001099 -0.0010252 -0.295926 -1.6594331 -0.4939008 0.0004205 -0.7520713 -0.3660489 0.0005237 0.0010996 0.0004775 -0.7286636 1.3666685 -0.1690034 -0.0002668 -0.276324 0.5095213 -0.0005203 0.0006376 0.000332 0.1406186 -0.9890109 -0.4005238 0.000134 -0.0105889 -0.4419455 -0.0001264 0.0008051 0.0000743 -0.0810414 1.1030895 0.2577387 0.0004473 0.4110852 0.1234022 -0.0002526 -0.0005384 0.0006818 0.1067482 -0.4937409 0.3511634 -0.000037 -0.0661649 -0.3083581 -0.0002264 -0.0011348 0.0002813 -0.0343034 1.4178573 0.0953438 -0.0000706 0.2236649 1.2739873 -0.0006478 0.001738 0.0021669 0.1366878 -1.0801673 -0.0568569 0.0001775 0.1684451 0.0353477 -0.0000915 0.0005978 0.000146 -0.3151424 0.6318273 0.1306327 -0.0005744 -0.1256409 0.0755922 -0.0001021 -0.0008833 -0.000184 -0.0648738 -0.4101019 -0.1499216 -0.0000124 0.0822762 0.100289 0.0000289 -0.0000768 -0.0002339 -0.2194584 0.2184243 -0.1988474 0.0003528 0.1366236 0.0787795 -0.0001284 0.0002717 -0.0002869 -0.0989443 1.8028775 0.4369899 -0.0010399 0.6998988 0.553605 -0.0004996 -0.0015439 -0.0003639 0.1741084 -0.3959664 -0.1806636 -0.0001399 -0.6119806 -0.3025969 0.0004763 0.0003225 0.0002888 -0.2601289 0.0980124 0.0751476 0.0003488 -0.0513498 0.2428153 -0.0001043 0.0003589 -0.0000362 -0.1313401 -0.0808788 0.1896723 0.0003241 0.1627072 -0.254037 0.000161 0.0001524 0.0004221 -0.1979548 0.1201108 0.0018611 -0.0000195 -0.0072718 0.1438711 0.0001036 0.0000171 0.0002246 0.3067042 0.0410364 0.0057924 0.0001053 -0.0420821 -0.1364779 0.0000417 -0.000218 0.0001529 0.188358 0.1321219 -0.0415063 0.0000891 0.0427342 -0.0056239 0.0000676 0.0000484 0.0000369 0.1441931 0.0643506 -0.0758205 -0.0000991 -0.0036658 -0.1191904 0.0000527 0.0001053 0.0001373 0.1715112 0.1400501 0.0200074 -0.0000779 -0.0638348 -0.0017155 0.0000738 -0.0001618 0.0000539 0.1507504 -0.127097 0.0896625 0.0002079 0.0671572 0.0309941 -0.0000696 0.0002488 -0.0001476 0.1735883 -0.0674108 0.1075972 -0.0002408 0.1226776 0.0140241 0.0001574 -0.0003797 0.0001246 0.1547956 -0.123039 -0.0661265 -0.0002668 -0.0754257 0.0547945 -0.0000774 -0.0003128 -0.000151 0.1680266 0.1888062 0.0429256 0.0001987 0.1039294 0.1448 -0.0000586 0.000148 -0.000077 0.3836051 0.2651904 0.032341 0.0001428 -0.0062218 0.1229941 -0.0000108 -0.000003 -0.0000533 0.3852215 unknown
polarizability: 288.6899785|5.814336|168.834695|0.004038|-0.0008741|61.0640714 unknown
InChI: InChI=1S/C13H10N2O/c14-8-5-6-10-12(7-8)15-11-4-2-1-3-9(11)13(10)16/h1-7,15H,14H2
charge 0 multiplicity 1
26 atoms
O  0.557081 2.692749 0.001412
N  0.173924 -1.455535 -0.002284
N  -4.696805 -1.132137 0.001365
C  -0.991178 -0.68149 -0.002016
C  -0.879089 0.746344 -0.002338
C  1.45995 -0.903877 -0.001656
C  1.619193 0.516604 -0.001909
C  0.434531 1.418093 -0.004528
C  -2.260008 -1.312065 -0.00091
C  -2.081075 1.507444 -0.001071
C  2.603243 -1.750694 -0.000193
C  2.93089 1.058929 -0.000324
C  -3.44191 -0.531054 0.000174
C  -3.337347 0.901308 0.000125
C  3.889985 -1.186637 0.001218
C  4.06114 0.225333 0.001196
H  0.083883 -2.472523 -0.001821
H  -2.327542 -2.407774 -0.000696
H  -1.97549 2.597636 -0.00143
H  2.476393 -2.840655 0.000056
H  3.01617 2.150895 -0.000691
H  -4.2502 1.508205 0.000935
H  4.766757 -1.844012 0.002433
H  5.067999 0.654958 0.002279
H  -4.797702 -2.142945 0.001403
H  -5.540192 -0.565902 0.002071
