program: Gaussian 09
title: 000148497
version: EM64L-G09RevD.01
frameworkgroup: C1[X(C9H10N2OS)]
method: RPBEPBE
basis: SDD
operation: Freq
keyword: #p
keyword: freq=noraman
keyword: PBEPBE/SDD
title: #p freq=noraman PBEPBE/SDD
converged: NO NO NO NO
title: Mulliken charges:
elementType: S O N N C C C C C C C C C H H H H H H H H H H
charge: 0.208113 -0.272923 -0.069427 -0.316932 0.441528 -0.379672 -0.491655 -0.256669 0.357097 -0.170626 -0.378709 -0.606871 -0.536405 0.263821 0.241500 0.251417 0.318850 0.251013 0.250958 0.209476 0.242954 0.221580 0.221581
chargesum: 0.00000
title: Mulliken charges with hydrogens summed into heavy atoms:
elementType: S O N N C C C C C C C C C
charge: 0.208113 -0.272923 -0.069427 0.001918 0.441528 -0.379672 -0.227834 -0.015169 0.357097 -0.170626 -0.127292 0.104576 0.149710
polarizability: 2.11738194e+02 -3.77578506e+00 1.39892435e+02 2.83004310e-04 -7.09161558e-03 6.02638366e+01
1716.lowfreq: -10.6767 -4.4747 -0.0023 -0.0018 0.0009 4.4997 14.4142 79.3737 87.2155
frequency: 10.3077 79.3566 87.1928 129.4322 137.5209 158.9430 209.7803 227.7963 299.1356 302.1075 325.2555 340.8602 373.7063 429.5530 440.3416 470.7585 485.9471 573.8763 591.1580 632.2664 659.1003 707.1165 722.8620 760.2100 802.9667 854.4841 928.1427 936.2398 988.3840 1012.0991 1037.1038 1113.0018 1113.6982 1124.6277 1135.6343 1154.1252 1176.2621 1205.5126 1251.0101 1288.8261 1372.8167 1420.1516 1434.7533 1445.8263 1452.5131 1455.5246 1464.7269 1466.0442 1476.3884 1497.7424 1570.9457 1586.7248 1632.7758 2957.4486 2987.3272 3043.1606 3067.0433 3111.8317 3126.4440 3152.9751 3179.2271 3182.4021 3608.1872
redmass: 1.0326 3.5561 4.2615 3.3872 3.7562 4.5406 3.4770 1.2002 5.5097 4.5084 2.6261 1.6089 7.7434 5.9587 2.9300 6.3403 5.1622 7.4347 7.8704 4.2216 6.7537 5.6614 3.3376 5.6351 1.3957 1.7193 4.8297 1.3313 5.2455 3.5396 5.9910 1.2602 1.8031 1.2771 1.3480 1.3740 2.1299 3.2404 1.5590 3.2766 5.5495 1.8058 1.1930 2.7584 1.0402 1.9949 1.0497 1.4486 1.0966 1.0842 7.7850 7.0750 7.9907 1.0332 1.0339 1.1037 1.1016 1.1012 1.0991 1.0890 1.0956 1.0918 1.0785
irintensity: 1.1822 1.2884 11.0027 0.9142 1.6083 3.1859 5.2341 0.7129 7.8008 0.4761 18.5475 110.7953 6.5524 1.6016 3.7166 3.7639 5.2136 0.7333 5.0755 10.6719 12.9589 5.9039 0.6487 21.4582 35.6434 50.4933 33.4492 0.0145 39.6553 8.3678 0.7043 0.2231 66.8105 1.5945 1.3005 1.3905 73.6733 205.1912 2.4415 10.0891 13.0597 20.6937 27.5265 83.1743 14.0365 73.7487 12.8812 50.0191 18.1959 27.1155 36.3627 640.0498 164.5494 61.1162 73.9557 50.6295 30.5529 22.7863 28.9654 4.1186 6.6284 3.5157 90.7552
temp: 298.150 k
press: 1.00000 atm
elementType: 16 8 7 7 6 6 6 6 6 6 6 6 6 1 1 1 1 1 1 1 1 1 1
symmnumber: 1
zpe: 460380.9 jmol-1
zpe.correction: 0.175350 hartree
zpe.thermalcorrener: 0.188149 hartree
zpe.thermalcorrenthalpy: 0.189093 hartree
zpe.thermalcorrgfe: 0.134471 hartree
zpe.sumelectzpe: -930.788095 hartree
zpe.sumelectthermal: -930.775296 hartree
zpe.sumelectthermalent: -930.774352 hartree
zpe.sumelectthermalfe: -930.828973 hartree
dipole: 2.6286 -1.6827 0.0006
dipole: 3.1211
quadrupole: -62.5344 -75.2151 -88.0896
quadrupole: 2.4023 0.0025 -0.0004
quadrupole: 12.7452 0.0646 -12.8099 2.4023 0.0025 -0.0004
hfenergy: -930.9634447 hartree
pointgroup: C01 [X(C9H10N2O1S1)]
dipole: -1.0832693 -0.5782013 -0.0002216 debye
dipolederiv: -0.435995 0.0046052 -0.0000044 -0.1364072 -0.5403827 -0.0000463 0.0000053 -0.0000358 0.039819 -1.3020012 0.6685041 0.0000411 0.7295133 -0.8290801 -0.0000329 0.0000586 -0.000034 -0.304106 -1.4831094 0.034904 0.0000169 0.3791722 -0.636766 -0.0000459 -0.0000244 -0.000031 -0.2333452 -1.7410704 -0.4543528 0.0000622 -0.4467901 -0.5527729 -0.0001908 0.0006757 0.0000047 -0.4754831 0.9019567 0.0120839 -0.0000019 0.4278437 0.2389993 0.0000045 0.0000417 -0.0000109 0.077275 0.2773479 -0.1602227 -0.0000212 -0.5190156 -0.2577566 -0.0000169 -0.0000362 -0.0000094 -0.1317607 -0.5009009 0.1538098 0.0000099 -0.0278758 -0.0117373 0.0000175 -0.000001 0.0000203 -0.2278416 0.2606773 0.0804708 0.0000059 0.1018688 0.1252709 0.0000187 0.0000023 0.0000203 -0.1034016 1.3081043 -0.6810983 -0.0000407 -0.6333979 0.3913993 0.000024 -0.0000466 0.000028 0.1035679 2.0629898 0.4020269 -0.0000485 -0.0548503 1.0535038 0.0001228 -0.0001648 0.0000845 0.0845458 -0.3304964 0.0307881 0.0000017 0.3321357 -0.1666253 0.0000055 0.0000197 0.0000073 -0.2151329 0.2837229 0.0767274 -0.0000283 0.4188746 0.5282324 0.0002497 -0.0001449 0.0001481 0.2526556 0.2782116 -0.0644979 -0.0000037 -0.4698294 0.7094055 0.000024 -0.0000294 0.0000238 0.329045 0.0990072 -0.0030183 0.0000008 0.0367169 -0.0533801 -0.0000193 0.0000028 -0.0000208 0.1773568 0.0873313 0.0324479 0.0000026 -0.015762 -0.0733114 -0.000018 0. -0.0000194 0.1624512 -0.0387787 -0.0728518 -0.0000067 -0.0589522 0.0645859 -0.0000096 -0.0000066 -0.0000093 0.1790953 0.265249 -0.026018 -0.00003 -0.0875232 0.0609367 0.0000358 -0.0002588 0.0000468 0.3500656 0.0991406 0.0596974 -0.0804567 -0.0929394 -0.026247 0.0620362 -0.0022757 0.1052307 -0.0637265 0.0991323 0.0594883 0.0803473 -0.0932594 -0.0263752 -0.0620922 0.0020061 -0.1053887 -0.0640685 -0.1967249 -0.0538297 0.0001585 0.0141643 0.062125 -0.0000618 0.0001659 -0.0000496 0.1266434 -0.1572951 0.0992586 -0.0000007 0.0589037 0.0581963 -0.0000032 -0.0000036 -0.0000024 0.1217092 0.0817537 -0.0994537 -0.1114358 0.0687097 -0.059105 -0.055488 -0.055584 -0.093321 -0.0926941 0.0817474 -0.0994691 0.1114319 0.0686998 -0.0591154 0.0554861 0.0555978 0.0933176 -0.0926697 unknown
polarizability: 211.8842962|-1.9334957|139.7463334|0.0008428|0.007047|60.2638366 unknown
InChI: InChI=1S/C9H10N2OS/c1-10-9-11-7-5-6(12-2)3-4-8(7)13-9/h3-5,10H,1-2H3
charge 0 multiplicity 1
23 atoms
S  -1.923384 1.888122 0.000175
O  3.5514 -0.615703 -0.000035
N  -1.42706 -0.787691 -0.000061
N  -3.752411 -0.241368 0.000088
C  -0.173225 -0.146026 -0.000001
C  -0.199144 1.284585 0.000117
C  1.068771 -0.825314 -0.000062
C  0.987236 2.039893 0.000168
C  2.25785 -0.06171 0.000005
C  -2.42128 0.084749 0.000032
C  2.222001 1.360004 0.00012
C  -4.184702 -1.64586 -0.000121
C  3.656629 -2.076013 -0.000098
H  1.067121 -1.917432 -0.000156
H  0.967875 3.133725 0.000251
H  3.169578 1.905364 0.000168
H  -4.445639 0.50327 -0.000194
H  -3.801216 -2.173799 0.891384
H  -3.802293 -2.17333 -0.892382
H  -5.28608 -1.68143 0.000545
H  4.735925 -2.286226 -0.000082
H  3.189798 -2.514114 -0.904137
H  3.189752 -2.514196 0.903876
