program: Gaussian 09
title: 000148487
version: EM64L-G09RevD.01
frameworkgroup: C1[X(C5H7N3O2)]
method: RPBEPBE
basis: SDD
operation: Freq
keyword: #pfreq=noraman
keyword: PBEPBE/SDD
title: #p freq=noraman PBEPBE/SDD
converged: NO NO NO NO
title: Mulliken charges:
elementType: O O N N N C C C C C H H H H H H H
charge: -0.238943 -0.190157 -0.436782 -0.018071 0.065310 0.326904 0.205446 -0.016284 -0.747534 -0.765299 0.317610 0.270977 0.205735 0.271209 0.279103 0.235320 0.235458
chargesum: 0.00000
title: Mulliken charges with hydrogens summed into heavy atoms:
elementType: O O N N N C C C C C
charge: -0.238943 -0.190157 -0.119172 -0.018071 0.065310 0.326904 0.205446 -0.016284 0.000386 -0.015418
polarizability: 1.14214619e+02 1.82616710e+00 9.77711720e+01 -2.73996541e-03 1.44379018e-02 4.32181083e+01
1716.lowfreq: -12.1926 -0.0006 -0.0005 -0.0003 16.4050 24.1903 56.4444 106.6794 109.0757
frequency: 56.1546 106.5750 109.0501 154.3009 184.4379 208.0482 256.7767 326.7535 372.1910 409.8662 542.8475 605.1245 623.2924 661.5273 691.8055 711.6411 725.0157 786.9239 953.3767 976.7597 1010.3044 1036.9405 1050.7569 1119.4812 1202.5536 1229.0550 1286.3834 1330.0220 1359.7384 1376.9534 1404.1490 1416.4368 1446.3909 1465.1246 1470.4129 1475.8259 1537.6621 1567.2990 2981.4247 2990.3670 3056.5249 3085.4384 3086.0261 3124.0267 3559.7144
redmass: 5.2995 1.1174 1.0766 3.6507 5.6420 3.9328 2.6924 4.2240 4.4290 8.6951 4.4543 4.4607 7.2566 5.4229 1.1558 8.3935 9.5025 7.2521 2.1584 2.2449 1.8810 1.4481 1.4758 6.7436 6.7042 1.8104 10.1546 3.8246 7.0105 4.5081 1.2702 1.2285 1.0425 1.1072 1.0436 1.1502 7.9874 4.5838 1.0396 1.0375 1.0984 1.0975 1.0993 1.0961 1.0818
irintensity: 0.6632 0.4002 0.4242 2.9589 0.4143 0.1180 3.1046 0.8664 2.1643 0.2802 2.2162 0.2039 12.2069 0.1426 93.7705 19.3196 2.3307 9.0939 2.8105 16.7609 3.1740 4.3192 7.7964 48.7376 72.9689 33.8480 57.8304 106.8069 115.1833 79.5353 3.8163 5.3342 15.4630 17.9818 19.8052 8.0442 79.2154 52.2334 24.2544 16.2028 16.8807 5.8368 16.5414 2.7511 38.7662
temp: 298.150 k
press: 1.00000 atm
elementType: 8 8 7 7 7 6 6 6 6 6 1 1 1 1 1 1 1
symmnumber: 1
zpe: 329759.5 jmol-1
zpe.correction: 0.125599 hartree
zpe.thermalcorrener: 0.135322 hartree
zpe.thermalcorrenthalpy: 0.136266 hartree
zpe.thermalcorrgfe: 0.090099 hartree
zpe.sumelectzpe: -508.605998 hartree
zpe.sumelectthermal: -508.596275 hartree
zpe.sumelectthermalent: -508.595331 hartree
zpe.sumelectthermalfe: -508.641498 hartree
dipole: 6.5666 5.8753 -0.0004
dipole: 8.8113
quadrupole: -57.6884 -58.0963 -57.4394
quadrupole: -1.3170 -0.0011 -0.0085
quadrupole: 0.0529 -0.3549 0.3020 -1.3170 -0.0011 -0.0085
hfenergy: -508.7315972 hartree
pointgroup: C01 [X(C5H7N3O2)]
dipole: 2.7384821 2.1256335 0.0016738 debye
dipolederiv: -0.8216788 0.1315363 0.0003246 0.2356267 -0.6062713 -0.0007488 -0.0002448 -0.0000843 -0.250222 -0.5335553 -0.2247554 -0.0002946 -0.2115565 -0.8335974 -0.0005739 -0.0004001 -0.0013408 -0.2180179 -0.6973465 -0.1586022 -0.000229 0.1558562 -0.3051085 0.0001991 -0.0005807 -0.0003582 -0.2345219 -0.3009552 0.13301 0.0001209 -0.0952233 -0.3914976 -0.0000251 -0.0001706 0.0000774 -0.2101147 1.6588243 0.338391 0.0002732 0.206442 1.2947848 0.0016737 0.0004228 0.001477 0.1945861 0.5017833 0.1996915 0.0001694 0.321805 0.4408275 0.0003084 0.0005925 0.0011991 0.0568824 0.446607 -0.1275424 0.000253 -0.2360006 0.3945612 -0.0003769 0.0009425 -0.0002533 0.0174676 -0.4940569 -0.3931133 -0.0003337 -0.3875392 -0.2228843 -0.0004238 0.0000977 -0.0001882 0.0019682 0.0545376 0.2155816 -0.0004223 0.1030971 -0.0692471 -0.0001562 -0.0005097 -0.001147 0.0270832 -0.1304843 0.0634418 -0.0001165 0.000626 -0.0300474 -0.0001697 -0.0008043 0.0000524 0.0896738 0.2093787 -0.0163475 -0.0000499 -0.0134677 0.1659087 0.0000715 0.0000093 0.000111 0.3301268 0.0512897 0.0136913 0.0790915 -0.0080514 0.0517913 0.0139828 0.0740182 -0.0262409 0.0048021 -0.0405501 -0.1641348 0.0006816 -0.0653144 -0.0661196 0.0004188 0.0005003 0.0007116 0.1209999 0.0506642 0.0134714 -0.079395 -0.0085901 0.0525722 -0.0143607 -0.074092 0.025903 0.0059199 0.1028363 -0.0528603 -0.0001337 0.0337454 -0.0453327 -0.0002948 0.000101 -0.0003509 0.135848 -0.0287442 0.0140708 0.066166 -0.0160773 0.0845796 0.0840474 0.1196248 0.0477592 -0.0358145 -0.0285497 0.0144703 -0.0661053 -0.0153777 0.0850806 -0.0835717 -0.1195067 -0.0473272 -0.036667 unknown
polarizability: 114.3887608|0.6638889|97.5970049|0.0354921|0.024973|43.2181332 unknown
InChI: InChI=1S/C5H7N3O2/c1-3-5(8(9)10)7-4(2)6-3/h6H,1-2H3
charge 0 multiplicity 1
17 atoms
O  -2.620546 0.416308 0.00047
O  -2.064172 -1.804219 -0.002485
N  1.512818 0.978266 0.000948
N  0.675207 -1.121387 0.001036
N  -1.7507 -0.554648 0.000218
C  0.130207 1.151029 0.00039
C  1.807254 -0.400513 0.001431
C  -0.355987 -0.17375 0.000438
C  -0.541065 2.489124 0.0003
C  3.203856 -0.93802 0.002431
H  2.194579 1.738692 0.000821
H  -1.193661 2.598233 0.883522
H  0.194523 3.31487 -0.002936
H  -1.198578 2.595693 -0.879514
H  3.154652 -2.037179 0.000578
H  3.771335 -0.61612 -0.891263
H  3.768779 -0.61908 0.898814
