program: Gaussian 09
title: 000148482
version: EM64L-G09RevD.01
frameworkgroup: C1[X(C14H11NO2)]
method: RPBEPBE
basis: SDD
operation: Freq
keyword: #p
keyword: freq=noraman
keyword: PBEPBE/SDD
title: #p freq=noraman PBEPBE/SDD
converged: NO YES NO NO
title: Mulliken charges:
elementType: O O N C C C C C C C C C C C C C C H H H H H H H H H H H
charge: -0.229697 -0.229765 -0.485455 0.301929 0.301980 0.201948 0.201973 -0.370552 -0.370579 -0.348365 -0.348355 -0.221725 -0.221712 -0.257496 -0.257512 -0.192768 -0.192782 0.424053 0.276906 0.276912 0.231449 0.231449 0.232488 0.232486 0.236844 0.236850 0.169732 0.169764
chargesum: 0.00000
title: Mulliken charges with hydrogens summed into heavy atoms:
elementType: O O N C C C C C C C C C C C C C C
charge: -0.229697 -0.229765 -0.061402 0.301929 0.301980 0.201948 0.201973 -0.093646 -0.093667 -0.116916 -0.116906 0.010763 0.010775 -0.020651 -0.020662 -0.023035 -0.023018
polarizability: 2.84692296e+02 -1.58372068e-03 1.92224268e+02 3.21352072e+00 -2.44993860e-03 8.14206554e+01
1716.lowfreq: -5.0672 -0.0006 -0.0005 -0.0003 5.3576 9.1328 48.9637 57.6241 75.1690
frequency: 48.9624 57.6201 75.1689 128.3374 138.3911 177.1748 183.6950 205.2719 232.8306 287.9532 305.1565 319.0046 365.9050 434.6160 446.8611 448.3007 468.4685 533.3526 536.8184 576.2060 611.8485 647.8182 651.1337 716.9244 728.7073 749.3507 765.7869 769.0077 780.3559 806.9686 852.2710 859.7695 887.9180 904.5908 944.7388 952.9536 976.6326 981.2130 986.1845 997.2443 1039.5798 1049.1054 1119.0413 1119.1038 1176.9333 1179.7065 1204.4477 1215.5967 1228.0696 1248.4057 1305.5728 1335.6694 1365.1169 1376.2924 1398.4395 1406.4488 1436.0930 1439.8271 1445.3390 1477.8410 1519.6598 1555.0879 1589.8725 1592.9462 1596.7158 1621.1611 1623.2923 2888.5757 2889.5154 3119.1424 3119.2267 3135.8333 3136.6634 3161.7321 3165.1286 3172.7311 3177.1666 3203.2354
redmass: 7.3097 4.2742 5.2574 7.0529 5.4177 6.8898 6.8345 3.1093 4.1152 2.9073 3.4972 8.6428 4.1093 8.1356 3.0847 3.3004 5.7890 2.8994 3.3628 6.0571 6.4432 6.2824 6.3181 2.4676 4.5541 1.2951 1.2306 1.6177 4.5451 4.8404 5.5132 1.4017 1.3267 4.9495 1.4206 1.4683 1.6018 1.6297 1.4007 1.3126 2.2654 2.2074 2.1435 1.8136 1.0719 1.0951 2.4133 2.6906 2.0200 1.5178 1.6468 2.2271 3.0019 1.8807 1.6142 2.8210 2.4890 2.6460 2.6992 2.5616 2.9810 6.8036 5.9872 3.0347 6.8225 6.2257 3.0726 1.0854 1.0855 1.0884 1.0884 1.0882 1.0886 1.0935 1.0949 1.0995 1.0972 1.0802
irintensity: 0.0007 3.5269 1.2285 1.7063 0.5265 11.9234 1.6396 1.9167 0.3622 1.9378 12.3863 7.9729 6.1941 0.7475 26.1347 1.1567 0.2791 14.5857 0.6722 0.2752 6.3448 20.5093 20.0140 29.8797 2.8654 33.0156 18.3796 182.2267 14.6739 2.2428 34.5371 0.8957 0.5882 2.8718 0.6320 0.0114 12.6376 1.1799 1.9852 0.9480 18.0655 2.7604 6.6267 0.0702 7.2566 0.6154 122.2619 87.9037 31.1328 9.3690 2.9332 150.7724 7.6552 8.5324 45.3837 1.9654 273.6197 6.2841 12.3313 20.3031 318.7812 235.7243 280.9509 267.8612 36.4364 112.4152 27.2633 216.8855 74.9405 16.7083 3.0078 2.7890 14.9243 37.5401 3.3670 11.7041 13.9983 102.6503
temp: 298.150 k
press: 1.00000 atm
elementType: 8 8 7 6 6 6 6 6 6 6 6 6 6 6 6 6 6 1 1 1 1 1 1 1 1 1 1 1
symmnumber: 1
zpe: 558511.5 jmol-1
zpe.correction: 0.212726 hartree
zpe.thermalcorrener: 0.226662 hartree
zpe.thermalcorrenthalpy: 0.227607 hartree
zpe.thermalcorrgfe: 0.171641 hartree
zpe.sumelectzpe: -744.112070 hartree
zpe.sumelectthermal: -744.098133 hartree
zpe.sumelectthermalent: -744.097189 hartree
zpe.sumelectthermalfe: -744.153154 hartree
dipole: -0.0008 -5.2519 -0.0004
dipole: 5.2519
quadrupole: -71.8883 -104.0828 -102.3348
quadrupole: -0.0021 0.9027 -0.0021
quadrupole: 20.8803 -11.3142 -9.5662 -0.0021 0.9027 -0.0021
hfenergy: -744.3247957 hartree
pointgroup: C01 [X(C14H11N1O2)]
dipole: 0.0004061 2.0662755 0.0000244 debye
polarizability: 284.5881347|-0.0060343|192.2242673|-5.6114916|0.0135623|81.5248179 unknown
InChI: InChI=1S/C14H11NO2/c16-9-11-5-1-3-7-13(11)15-14-8-4-2-6-12(14)10-17/h1-10,15H
charge 0 multiplicity 1
28 atoms
O  -1.374428 -2.675537 0.842018
O  1.373882 -2.67541 -0.84261
N  0.00009 -0.438836 -0.000041
C  -1.25558 0.181113 -0.091254
C  1.255874 0.180868 0.091157
C  -2.441074 -0.55556 0.279492
C  2.441223 -0.555903 -0.279897
C  -1.42244 1.503752 -0.602636
C  1.423017 1.503321 0.602912
C  -3.717983 0.064363 0.169985
C  3.718236 0.063785 -0.170359
C  -2.698544 2.083866 -0.70762
C  2.699214 2.0832 0.707901
C  -3.862374 1.375671 -0.309058
C  3.862908 1.374944 0.309001
C  -2.404823 -1.938843 0.779719
C  2.40455 -1.939011 -0.780431
H  0.000026 -1.480972 -0.000309
H  -0.552036 2.056333 -0.965114
H  0.55274 2.055884 0.965733
H  -4.601551 -0.5154 0.466949
H  4.601665 -0.516074 -0.467563
H  -2.790464 3.094715 -1.120915
H  2.791342 3.093909 1.121503
H  -4.850639 1.838328 -0.389318
H  4.851243 1.837439 0.389266
H  -3.395246 -2.333234 1.116962
H  3.394772 -2.333708 -1.117873
