program: Gaussian 09
title: 000148523
version: EM64L-G09RevD.01
frameworkgroup: C1[X(C19H26O2)]
method: RPBEPBE
basis: SDD
operation: Freq
keyword: #pfreq=noraman
keyword: PBEPBE/SDD
title: #p freq=noraman PBEPBE/SDD
converged: YES YES NO NO
title: Mulliken charges:
elementType: O O C C C C C C C C C C C C C C C C C C C H H H H H H H H H H H H H H H H H H H H H H H H H H
charge: -0.305702 -0.236357 0.417192 -0.177562 -0.221547 -0.143235 -0.110816 -0.107947 -0.550315 -0.532194 -0.532264 0.233389 -0.477432 -0.811298 0.538290 -0.639193 -0.493128 -0.809769 -0.564006 -0.585773 0.178629 0.254964 0.245217 0.232384 0.235077 0.211698 0.210971 0.233299 0.229199 0.204178 0.212852 0.230831 0.221934 0.221888 0.218505 0.234279 0.227153 0.220701 0.236260 0.220385 0.216334 0.225646 0.235255 0.220326 0.245713 0.230729 0.255259
chargesum: 0.00000
title: Mulliken charges with hydrogens summed into heavy atoms:
elementType: O O C C C C C C C C C C C C C C C C C C C
charge: -0.305702 -0.236357 0.417192 0.077403 0.023670 0.089149 0.124261 0.103751 -0.106044 -0.098818 -0.088581 0.233389 -0.033611 -0.131361 0.538290 -0.182232 -0.056409 -0.128542 -0.087564 -0.330513 0.178629
polarizability: 2.56630667e+02 -1.73403871e+00 1.85476374e+02 -1.41747806e+01 6.18651917e-01 1.55207687e+02
1716.lowfreq: -4.6059 -0.0004 0.0003 0.0008 9.8676 13.7292 35.4306 54.2756 88.8558
frequency: 34.9100 54.2133 88.8292 125.7439 148.9545 170.9758 181.6900 190.6980 200.8639 216.8645 234.3529 240.6793 263.3173 270.0198 284.8351 315.9392 331.5292 352.7225 366.7517 387.8247 400.9600 421.4312 431.4112 454.3672 481.5261 498.7336 517.6470 528.2221 541.1144 559.6651 612.6153 637.5832 657.2585 676.3685 723.7853 759.8230 771.7137 777.8139 798.8707 803.7683 830.7405 840.6981 865.4434 883.5507 900.8223 913.1811 924.5653 935.9008 942.4669 951.8065 967.2453 969.7470 990.1957 993.4548 1009.3116 1027.6688 1034.0400 1043.3123 1055.8180 1075.9960 1076.5669 1112.0796 1116.4493 1119.8550 1126.4786 1140.8133 1148.0541 1165.1184 1176.2671 1186.0969 1186.4678 1191.0284 1199.3973 1209.0185 1228.8581 1233.8673 1251.0306 1265.0793 1275.8161 1278.9581 1283.9994 1291.1289 1306.8288 1320.0355 1323.5594 1330.1228 1335.7009 1340.8017 1343.9715 1347.8152 1352.5103 1353.9942 1356.7726 1369.4253 1386.2417 1388.8740 1444.6535 1453.5656 1455.8712 1463.7346 1465.8329 1469.3403 1474.3552 1480.5395 1482.1104 1488.9387 1494.3049 1583.4688 1624.7536 2921.2274 2952.2394 2956.3998 2969.9163 2971.2740 2973.7480 2977.8294 2978.4625 2981.9587 2984.6682 2986.7892 2993.7626 3027.9823 3034.4208 3040.2354 3042.2840 3049.7493 3057.2999 3061.8028 3065.0627 3075.8049 3082.2095 3092.8152 3111.1821 3118.1649 3142.5086
redmass: 6.6077 3.5187 3.6532 4.2775 2.7421 2.9841 2.5659 1.4097 2.2165 2.4506 2.3827 1.7624 2.5184 2.2505 2.2764 3.0530 2.5291 2.4329 2.8991 2.7781 4.0728 3.3632 3.2011 3.2827 3.4217 2.7973 3.5962 2.8064 2.7875 2.6146 3.2760 3.4267 4.8702 3.5497 3.5008 4.3084 2.8483 2.2155 3.6001 2.2101 1.9077 2.3106 1.9512 1.4399 1.7786 1.9274 1.6865 2.0871 1.9253 1.8733 2.3029 1.8297 1.4805 1.8763 1.8747 1.9616 1.7383 1.7202 1.8530 2.1688 2.5533 2.0620 1.7457 2.6832 1.8314 1.5580 1.7130 2.3082 1.4920 1.5507 1.6493 1.6368 2.1738 1.7267 1.4819 1.7017 1.5177 1.6354 1.7106 2.0290 1.4466 1.3996 1.4278 1.4477 1.4819 1.3929 1.4504 1.3013 2.0901 1.4586 1.4820 2.3020 1.4894 1.4799 1.2115 1.2120 1.0781 1.0873 1.0873 1.0739 1.0823 1.0885 1.0842 1.0584 1.0615 1.0574 1.0623 9.9913 7.7524 1.0814 1.0657 1.0794 1.0637 1.0593 1.0656 1.0667 1.0681 1.0435 1.0378 1.0655 1.0604 1.0999 1.0974 1.0982 1.0992 1.1004 1.0986 1.0952 1.0980 1.0989 1.0987 1.0964 1.0898 1.0912 1.0964
irintensity: 2.3836 0.9806 1.7759 2.1237 0.6657 1.8440 2.3003 0.2596 1.3684 1.2746 0.4306 0.3683 0.3742 0.5067 0.5619 1.8876 0.5154 2.8232 4.0100 2.2694 4.0704 0.8321 2.4451 3.0284 3.4059 2.3262 8.0554 0.0491 0.5195 0.6761 1.9972 1.0040 1.5207 7.0955 3.2108 2.1206 1.4244 6.3764 29.4568 0.1179 3.5904 2.2988 8.8200 19.4217 3.2528 10.1246 1.9184 16.7351 9.7234 9.3210 4.0517 5.5609 3.4510 2.1199 3.5361 7.5144 3.1742 2.2439 1.9252 2.1344 2.7008 1.8507 0.9981 2.2025 4.5931 3.6460 1.3371 0.7590 12.0803 25.4924 1.4448 7.1866 0.5397 2.7599 0.3851 43.1848 0.9449 12.5561 7.3224 36.3145 1.4670 1.7038 1.7737 3.5191 9.2045 0.9060 2.4649 0.4125 6.2947 0.7955 0.6982 6.1041 3.5945 1.6404 11.6599 34.3820 18.0427 17.5263 9.5043 4.1003 9.1972 7.8147 7.8438 0.3437 13.6824 5.7130 7.8439 164.9746 194.6282 9.6984 16.2634 4.3456 29.0394 40.9743 9.4226 14.6724 39.6624 15.9227 11.3661 43.9729 33.1160 23.3375 42.4549 10.9116 75.7995 37.0286 35.8954 22.0406 21.4337 36.2885 29.5057 34.5622 23.6607 10.8203 45.4657
temp: 298.150 k
press: 1.00000 atm
elementType: 8 8 6 6 6 6 6 6 6 6 6 6 6 6 6 6 6 6 6 6 6 1 1 1 1 1 1 1 1 1 1 1 1 1 1 1 1 1 1 1 1 1 1 1 1 1 1
symmnumber: 1
zpe: 1069597.3 jmol-1
zpe.correction: 0.407388 hartree
zpe.thermalcorrener: 0.425998 hartree
zpe.thermalcorrenthalpy: 0.426942 hartree
zpe.thermalcorrgfe: 0.362559 hartree
zpe.sumelectzpe: -888.425194 hartree
zpe.sumelectthermal: -888.406584 hartree
zpe.sumelectthermalent: -888.405640 hartree
zpe.sumelectthermalfe: -888.470022 hartree
dipole: -4.3901 -0.9119 4.1941
dipole: 6.1397
quadrupole: -164.0327 -118.8328 -132.6498
quadrupole: -5.5435 -1.0425 2.6363
quadrupole: -25.5276 19.6723 5.8553 -5.5435 -1.0425 2.6363
hfenergy: -888.8325819 hartree
pointgroup: C01 [X(C19H26O2)]
dipole: -1.7173358 -0.3308651 1.6661529 debye
polarizability: 256.3820088|-2.3897121|185.5168565|-14.9106244|0.4663795|155.415863 unknown
InChI: InChI=1S/C19H26O2/c1-18-7-5-12(20)9-11(18)3-4-13-14(18)6-8-19(2)15(13)10-16-17(19)21-16/h9,13-17H,3-8,10H2,1-2H3
charge 0 multiplicity 1
47 atoms
O  -4.306545 0.283595 -1.664021
O  5.617196 0.37199 -1.084081
C  -2.803331 -0.790849 0.141344
C  -2.097059 0.579196 -0.140032
C  -4.221699 -0.514807 -0.379053
C  -0.694141 0.66653 0.487443
C  -4.45964 0.96733 -0.308154
C  0.179338 -0.471261 -0.142597
C  -3.174817 1.65979 0.156672
C  -1.978142 -1.886034 -0.570174
C  -0.503476 -1.870785 -0.073956
C  1.670451 -0.491195 0.398005
C  -0.034406 2.037975 0.226479
C  -2.978302 -1.107846 1.653687
C  2.261003 0.92591 0.270747
C  1.41224 2.078696 0.775083
C  2.498835 -1.491276 -0.468871
C  1.741234 -0.910035 1.902012
C  4.026222 -1.331749 -0.326553
C  3.515749 1.162854 -0.232533
C  4.471591 0.10223 -0.60699
H  -1.952021 0.610472 -1.240096
H  -5.020006 -1.256507 -0.25519
H  -0.764845 0.521349 1.586431
H  -5.446641 1.412444 -0.145861
H  0.259679 -0.208864 -1.223436
H  -3.25611 1.899238 1.235951
H  -2.990488 2.603945 -0.385861
H  -2.011822 -1.703545 -1.662614
H  -2.409266 -2.891977 -0.394367
H  -0.472255 -2.253738 0.963879
H  0.073464 -2.589742 -0.684498
H  -0.627411 2.845602 0.696868
H  -0.023524 2.235663 -0.865009
H  -3.583868 -2.025202 1.78219
H  -2.013255 -1.276797 2.15919
H  -3.496162 -0.289215 2.185964
H  1.361129 2.02396 1.883993
H  1.898582 3.040402 0.529933
H  2.226715 -1.339484 -1.533385
H  2.2163 -2.528154 -0.209265
H  1.391205 -1.948423 2.040839
H  2.780261 -0.854943 2.272742
H  1.126794 -0.255181 2.544229
H  4.569634 -2.011061 -1.006885
H  4.351501 -1.590105 0.70232
H  3.88741 2.191208 -0.333219
