program: Gaussian 09
title: 000148463
version: EM64L-G09RevD.01
frameworkgroup: C1[X(C13H10O5)]
method: RPBEPBE
basis: SDD
operation: Freq
keyword: #pfreq=noraman
keyword: PBEPBE/SDD
title: #p freq=noraman PBEPBE/SDD
converged: YES YES NO NO
title: Mulliken charges:
elementType: O O O O O C C C C C C C C C C C C C H H H H H H H H H H
charge: -0.246660 -0.212621 -0.213192 -0.450539 -0.197532 0.315958 0.088555 0.364306 0.017148 -0.002030 0.034817 -0.536317 -0.380957 -0.238401 -0.172187 -0.326734 0.117038 -0.507942 0.213141 0.216290 0.260094 0.280154 0.267467 0.249543 0.347984 0.234383 0.243962 0.234272
chargesum: 0.00000
title: Mulliken charges with hydrogens summed into heavy atoms:
elementType: O O O O O C C C C C C C C C C C C C
charge: -0.246660 -0.212621 -0.213192 -0.102555 -0.197532 0.315958 0.088555 0.364306 0.017148 -0.002030 0.034817 -0.106887 -0.120863 0.041753 0.095280 -0.077190 0.117038 0.204675
polarizability: 2.51592451e+02 -5.64674085e+00 1.92020068e+02 7.85708936e-01 -4.71178655e+00 7.21524186e+01
1716.lowfreq: -5.4633 -0.0009 -0.0009 -0.0006 3.1090 5.9364 33.6591 64.5383 68.4741
frequency: 33.6485 64.5358 68.4715 82.8404 124.4141 160.0945 171.3682 180.2241 207.3293 222.2324 257.4884 269.8575 284.8587 300.2908 352.2634 355.0212 390.8965 399.5652 445.0046 481.1804 511.6181 560.8450 574.3004 607.0142 623.9995 655.7252 688.5254 703.5943 742.7644 755.5232 790.1564 810.4384 846.2079 849.7928 862.7614 893.8827 933.7446 951.2110 979.6165 984.5998 1006.6849 1025.7069 1045.2882 1092.7152 1109.3002 1127.2786 1137.5704 1162.8574 1182.5760 1203.8574 1212.4792 1252.1601 1304.8441 1330.2234 1365.5155 1396.7349 1411.8402 1429.2948 1441.6368 1461.2990 1464.0673 1466.7564 1485.3335 1535.4226 1582.6394 1611.8531 1619.2368 1687.4096 2941.1169 2997.0421 3011.5068 3100.9141 3140.0826 3160.0656 3186.5336 3224.3869 3266.9779 3542.7921
redmass: 3.1429 6.0035 6.1649 4.8165 5.2300 3.4302 4.5062 3.0903 1.7899 3.6432 2.7728 2.0286 1.8419 5.1345 8.6137 5.0158 5.3991 8.2566 5.6683 6.9597 5.3349 4.4711 6.4199 4.8767 7.3658 4.8542 6.9771 4.8514 8.5498 1.4797 4.1821 2.7404 3.4837 3.4600 1.4730 6.9665 7.1327 6.0734 2.6187 1.7058 3.7533 2.1693 3.6764 3.2693 1.2494 1.7714 1.8537 1.4999 1.8251 1.3009 1.0952 1.9692 3.0118 2.5146 3.4140 1.9406 1.7722 6.3283 1.5777 1.0539 1.0649 3.9546 1.1121 5.7382 9.0670 9.7130 7.6376 10.7791 1.0634 1.0298 1.0978 1.1051 1.1039 1.0885 1.0974 1.0922 1.1074 1.0664
irintensity: 7.8914 2.5124 1.7944 2.6556 6.4076 2.2349 1.5806 3.5006 0.2560 5.1020 15.3819 58.9129 65.4799 6.4155 2.8052 2.0146 2.3915 7.0245 5.6688 9.6475 2.9611 4.1990 0.8935 6.3938 5.0485 11.2506 33.0518 0.4634 34.3107 82.4133 1.2069 13.4839 18.3493 8.8108 4.4903 13.5683 77.4876 66.6092 35.5288 10.9048 29.3267 27.4876 28.6318 128.5709 0.0071 28.5787 106.1238 67.5950 45.4733 12.4223 4.0316 19.0276 71.8777 73.4347 8.2152 94.8337 4.9718 11.7848 20.1023 33.3588 14.8935 24.7657 9.8312 2.6137 94.9974 61.3607 43.6071 576.0618 65.2056 50.6573 38.3357 32.9908 17.7084 2.3814 4.4393 2.5789 0.3930 3.5731
temp: 298.150 k
press: 1.00000 atm
elementType: 8 8 8 8 8 6 6 6 6 6 6 6 6 6 6 6 6 6 1 1 1 1 1 1 1 1 1 1
symmnumber: 1
zpe: 531751.5 jmol-1
zpe.correction: 0.202533 hartree
zpe.thermalcorrener: 0.218214 hartree
zpe.thermalcorrenthalpy: 0.219158 hartree
zpe.thermalcorrgfe: 0.159192 hartree
zpe.sumelectzpe: -876.172872 hartree
zpe.sumelectthermal: -876.157192 hartree
zpe.sumelectthermalent: -876.156248 hartree
zpe.sumelectthermalfe: -876.216214 hartree
dipole: -6.4696 5.1374 -1.4813
dipole: 8.3930
quadrupole: -105.3384 -84.3757 -106.6340
quadrupole: 16.1387 -0.7977 -5.2717
quadrupole: -6.5557 14.4070 -7.8513 16.1387 -0.7977 -5.2717
hfenergy: -876.3754059 hartree
pointgroup: C01 [X(C13H10O5)]
dipole: 2.8615177 1.5012462 0.6794326 debye
polarizability: 251.7127968|-5.0670115|190.7812703|0.9921835|12.3912003|73.2708707 unknown
InChI: InChI=1S/C13H10O5/c1-16-13-11-8(4-5-17-11)9(6-14)7-2-3-10(15)18-12(7)13/h2-5,14H,6H2,1H3
charge 0 multiplicity 1
28 atoms
O  2.707383 -1.478175 -0.264728
O  -2.168382 -0.991419 -0.223679
O  -0.153141 -2.697279 -0.435766
O  0.334069 3.764994 -0.740358
O  -4.464762 -0.774196 -0.184245
C  0.632591 1.513419 0.137021
C  1.708681 0.609034 0.015078
C  -0.685006 0.968226 0.043499
C  1.472409 -0.789272 -0.176715
C  -0.888425 -0.43793 -0.143781
C  0.190283 -1.368677 -0.260437
C  0.86488 2.98119 0.403087
C  3.159323 0.765384 0.042446
C  -1.878713 1.792993 0.115519
C  3.708692 -0.482531 -0.126202
C  -3.141673 1.253687 0.043661
C  -3.372944 -0.179378 -0.119143
C  0.91293 -3.706766 -0.597662
H  0.348226 3.292024 1.337356
H  1.947966 3.170382 0.531716
H  3.719181 1.690456 0.161607
H  -1.751667 2.876436 0.192208
H  4.728421 -0.854012 -0.177724
H  -4.039993 1.874342 0.091657
H  0.513952 4.727406 -0.579628
H  1.528538 -3.491179 -1.487519
H  0.368543 -4.653042 -0.726867
H  1.555338 -3.750021 0.298201
