program: Gaussian 09
title: 000148524
version: EM64L-G09RevD.01
frameworkgroup: C1[X(C14H10N6O9)]
method: RPBEPBE
basis: SDD
operation: Freq
keyword: #p
keyword: freq=noraman
keyword: PBEPBE/SDD
title: #p freq=noraman PBEPBE/SDD
converged: YES YES NO NO
title: Mulliken charges:
elementType: O O O O O O O O O N N N N N N C C C C C C C C C C C C C C H H H H H H H H H H
charge: -0.229188 -0.172042 -0.170148 -0.166919 -0.168446 -0.177924 -0.176677 -0.188260 -0.181926 -0.107665 -0.100284 0.003092 0.003165 0.005791 0.019725 0.217538 0.472180 0.255498 0.343887 0.328351 0.195209 -0.506242 -0.564976 0.302204 -0.542323 0.465472 -0.531537 -0.737688 -0.764085 0.341767 0.342069 0.313176 0.335264 0.284553 0.243215 0.243061 0.219024 0.254240 0.297846
chargesum: 0.00000
title: Mulliken charges with hydrogens summed into heavy atoms:
elementType: O O O O O O O O O N N N N N N C C C C C C C C C C C C C C
charge: -0.229188 -0.172042 -0.170148 -0.166919 -0.168446 -0.177924 -0.176677 -0.188260 -0.181926 -0.107665 -0.100284 0.003092 0.003165 0.005791 0.019725 0.217538 0.472180 0.255498 0.343887 0.328351 0.195209 -0.164475 -0.222907 0.302204 -0.229147 0.465472 -0.196272 0.033142 0.007024
polarizability: 4.16012588e+02 4.96143006e+00 2.63384817e+02 1.10217317e+01 -2.11408040e+00 1.41388416e+02
1716.lowfreq: -7.5132 -4.6424 -3.7907 -0.0004 -0.0004 0.0004 11.5817 24.4520 32.3159
frequency: 11.4726 24.4419 32.3122 44.8815 48.4686 52.0435 55.2388 69.8890 87.6003 96.5471 117.7487 130.2973 148.6738 153.7121 160.7072 165.9645 176.6502 186.8045 215.2244 241.7635 248.2345 297.2732 311.6013 316.6478 328.2080 332.7808 339.5232 348.5726 367.5024 372.2602 402.1223 441.5341 449.5226 464.3579 486.7257 510.7051 519.1529 547.5008 574.6812 600.7873 621.9570 639.4530 661.0737 682.3613 684.0973 688.0331 699.1623 705.4641 723.6854 730.7220 736.2701 738.7362 754.5186 758.9418 815.2540 851.1093 874.9958 889.4957 936.9880 951.1786 952.4601 957.3790 960.0051 1023.7706 1029.1429 1034.2910 1035.4462 1073.2194 1079.7041 1133.5954 1174.4906 1194.1874 1198.7154 1202.1206 1208.9160 1209.9674 1210.9484 1217.2785 1235.9081 1243.0864 1345.7832 1364.3416 1371.9990 1373.9630 1377.4318 1378.8199 1381.6580 1396.3259 1400.1378 1407.0160 1415.2255 1443.8634 1452.8302 1454.6989 1461.6502 1475.1941 1475.7723 1579.1291 1586.4777 1600.2059 1609.5521 2997.7681 3015.7853 3080.2066 3100.4439 3115.5243 3132.6737 3188.4387 3191.9420 3193.2000 3199.5362
redmass: 12.0139 8.7988 10.6368 11.2672 11.8902 12.4884 13.9497 8.0275 7.5946 8.6402 7.4291 8.4305 3.2472 1.3634 3.9848 2.0153 5.0682 3.0498 8.4534 5.0163 7.5729 5.0102 8.8978 6.2705 5.8038 9.9424 7.6575 8.2622 4.1087 3.3480 5.9344 8.2581 6.5586 4.7541 5.9466 7.1928 5.2092 6.2053 8.3325 5.1733 9.2571 5.0319 9.1838 10.3482 5.6564 8.6378 5.8836 3.5861 8.3442 7.8689 8.4721 4.8619 7.1633 6.1958 6.8590 7.6484 6.6717 7.7059 3.0575 1.6271 1.7722 1.4067 1.5865 1.4912 1.7588 1.5813 1.5790 1.9400 1.9152 6.5019 3.2167 1.8689 2.2505 4.4384 3.6445 5.8240 4.5287 9.5965 7.9521 10.4066 5.3013 4.5772 8.3159 6.5966 5.4416 8.6777 5.1553 1.3190 1.2010 3.9968 6.4787 1.5774 1.2989 2.0952 3.8485 1.1421 1.1443 8.3862 8.5482 7.9832 8.0985 1.0380 1.0394 1.0964 1.0937 1.0989 1.1015 1.0926 1.0926 1.0928 1.0930
irintensity: 0.0351 0.4632 0.7867 0.3580 0.0428 0.9627 1.1386 0.3171 1.9227 3.0813 1.2627 2.4738 3.4586 3.7465 0.9158 3.2963 0.1483 5.1762 2.2442 3.1429 4.4598 3.4061 0.3107 0.6681 6.0250 0.0557 0.1631 2.9692 4.0026 0.8080 4.1208 7.6576 1.0958 0.5219 4.7987 0.3903 6.8329 10.5088 9.2433 21.2487 1.7812 2.0905 28.4096 43.4370 19.1341 2.8677 13.9000 10.7463 3.1737 22.6152 19.0588 8.0946 1.6078 10.8625 6.7242 18.5625 11.4671 7.2756 5.5562 10.4413 26.6409 5.7241 38.2157 1.2445 9.3877 1.3576 2.8317 51.1668 41.8793 9.5521 30.8279 8.5113 79.6468 206.8175 137.7963 159.6647 168.3149 80.7869 117.3333 42.4203 96.5103 19.1688 32.7428 94.3482 87.1363 29.5815 70.9284 17.1900 71.1964 40.0307 18.4559 66.9707 33.0299 8.7854 101.7510 21.2845 15.7607 10.6847 7.1804 14.1667 18.9243 5.7796 2.2738 8.3539 8.7372 8.6274 6.3580 8.6584 21.4828 32.0364 12.9508
temp: 298.150 k
press: 1.00000 atm
elementType: 8 8 8 8 8 8 8 8 8 7 7 7 7 7 7 6 6 6 6 6 6 6 6 6 6 6 6 6 6 1 1 1 1 1 1 1 1 1 1
symmnumber: 1
zpe: 655349.4 jmol-1
zpe.correction: 0.249609 hartree
zpe.thermalcorrener: 0.275618 hartree
zpe.thermalcorrenthalpy: 0.276562 hartree
zpe.thermalcorrgfe: 0.189911 hartree
zpe.sumelectzpe: -1542.517731 hartree
zpe.sumelectthermal: -1542.491723 hartree
zpe.sumelectthermalent: -1542.490779 hartree
zpe.sumelectthermalfe: -1542.577429 hartree
dipole: -4.1460 -0.3859 1.4003
dipole: 4.3930
quadrupole: -204.6691 -201.4211 -169.8694
quadrupole: -2.2952 -3.0263 -3.3667
quadrupole: -12.6826 -9.4346 22.1172 -2.2952 -3.0263 -3.3667
hfenergy: -1542.7673409 hartree
pointgroup: C01 [X(C14H10N6O9)]
dipole: -1.6327429 -0.5518558 -0.1297121 debye
polarizability: 415.5627249|-12.6154803|143.082128|9.0757974|13.491575|262.1409689 unknown
InChI: InChI=1S/C14H10N6O9/c1-7-11(3-10(17(22)23)6-12(7)18(24)25)15-16(21)9-4-13(19(26)27)8(2)14(5-9)20(28)29/h3-6H,1-2H3
charge 0 multiplicity 1
39 atoms
O  0.11687 0.659746 -1.657556
O  -3.255218 -1.854194 3.077519
O  -4.382219 0.716846 -3.339189
O  -5.094636 -0.505319 3.022051
O  -5.940503 1.468354 -1.850971
O  6.109018 -1.464766 -1.567273
O  4.358623 -1.300229 -3.017994
O  4.043014 1.851426 3.355708
O  6.029646 1.434144 2.310076
N  -0.259239 0.194711 -0.491789
N  0.517864 -0.175353 0.51436
N  -4.015982 -0.984396 2.506434
N  -4.828423 0.887003 -2.142242
N  4.88683 -1.166576 -1.849583
N  4.746732 1.35678 2.395267
C  -4.546289 -0.090099 0.186004
C  -1.707474 0.087112 -0.237687
C  2.630422 -0.750089 -0.759015
C  -3.585632 -0.474817 1.169674
C  -3.968354 0.406659 -1.019721
C  1.933391 -0.108929 0.322947
C  -2.192955 -0.408765 0.983698
C  -2.583727 0.493029 -1.255977
C  4.047802 -0.59889 -0.752441
C  2.624192 0.552104 1.364797
C  4.023786 0.644279 1.307912
C  4.759891 0.078873 0.255206
C  -6.036436 -0.271336 0.37258
C  1.883641 -1.610863 -1.748239
H  -1.509124 -0.738216 1.768433
H  -2.196867 0.864233 -2.208068
H  2.075181 0.994875 2.199428
H  5.849896 0.148095 0.225771
H  -6.482295 0.633393 0.822103
H  -6.542814 -0.435155 -0.589883
H  -6.255246 -1.108311 1.051983
H  0.963965 -2.013118 -1.290082
H  2.495849 -2.449368 -2.111891
H  1.591219 -1.014672 -2.631551
