program: Gaussian 09
title: 000148458
version: EM64L-G09RevD.01
frameworkgroup: C1[X(C12H8F4N2)]
method: RPBEPBE
basis: SDD
operation: Freq
keyword: #p
keyword: freq=noraman
keyword: PBEPBE/SDD
title: #p freq=noraman PBEPBE/SDD
converged: YES YES NO NO
title: Mulliken charges:
elementType: F F F F N N C C C C C C C C C C C C H H H H H H H H
charge: -0.217519 -0.217518 -0.217518 -0.217519 -0.662420 -0.662420 0.449501 0.449501 -0.546019 -0.546019 -0.546019 -0.546019 0.076280 0.076281 0.237647 0.237647 0.237655 0.237654 0.261786 0.261786 0.261782 0.261782 0.332422 0.332422 0.332422 0.332422
chargesum: 0.00000
title: Mulliken charges with hydrogens summed into heavy atoms:
elementType: F F F F N N C C C C C C C C C C C C
charge: -0.217519 -0.217518 -0.217518 -0.217519 0.002424 0.002423 0.449501 0.449501 -0.284233 -0.284232 -0.284237 -0.284238 0.076280 0.076281 0.237647 0.237647 0.237655 0.237654
polarizability: 2.96066317e+02 -3.96459264e-05 1.40991075e+02 2.22012229e-02 -8.35490571e-04 6.46417417e+01
1716.lowfreq: -2.2779 -1.5597 -0.0009 -0.0008 -0.0008 4.9700 33.3211 55.2819 77.8684
frequency: 33.3211 55.2777 77.8684 129.8578 145.5158 205.3085 215.5829 249.4216 254.3449 259.9734 260.2776 264.0002 290.9741 308.6175 313.2792 363.4375 429.0489 430.3700 439.0656 439.5259 464.6099 480.7120 490.2110 515.4620 522.0486 524.6584 566.0737 582.5042 623.0065 652.4364 666.6667 706.4239 709.8953 788.4509 837.8428 845.3531 856.8028 858.5427 866.0275 904.5061 908.7602 951.0033 1053.1649 1098.4081 1101.9542 1125.8378 1195.4680 1226.3167 1246.2443 1280.0106 1315.0371 1335.2440 1383.5862 1394.1399 1455.6687 1455.7244 1522.6136 1555.8136 1567.8978 1580.4009 1612.4309 1612.9386 1659.6695 1664.5783 3168.9858 3172.1221 3172.2829 3175.7027 3571.9060 3573.1110 3717.2153 3717.2333
redmass: 11.3081 5.7666 7.4654 7.0518 11.1446 10.2915 11.5412 4.8227 8.1520 4.7772 3.9586 4.2543 12.8278 9.0438 6.1307 4.8932 1.2603 1.2468 1.0154 1.0158 10.8506 7.2280 14.0481 6.8453 5.4202 5.5485 4.7352 5.1445 3.9960 3.8469 10.2071 4.3473 4.6036 5.0856 5.8437 1.4761 1.3615 1.3989 1.7316 3.4728 3.4902 6.0019 1.7344 1.9332 1.9161 2.2865 10.6542 1.3492 1.2760 2.3521 2.5905 6.3421 7.3667 8.5537 7.6655 6.1418 4.8345 4.3679 6.8125 8.0495 1.3231 1.2500 5.0355 5.8435 1.0919 1.0907 1.0926 1.0920 1.0442 1.0446 1.1052 1.1052
irintensity: 0.0000 1.4814 0.1785 0.1300 1.1124 0.2200 0.0000 0.2774 2.7386 0.0000 12.0276 0.1006 7.2028 0.0000 15.6435 2.8073 39.4142 629.8283 0.0002 0.0069 0.0000 6.7830 0.0000 0.0064 0.0000 0.3519 11.1654 0.7270 4.7918 1.1881 65.4625 0.7672 5.7879 0.0000 3.1374 95.8555 0.4805 0.0000 19.5186 69.0280 3.3526 0.0000 14.7767 15.3422 195.3715 0.0000 73.5793 0.4546 11.5138 0.0000 66.2993 51.4162 3.0091 0.0000 3.9903 2.5071 814.3980 0.0000 120.1341 7.4792 0.0001 183.5532 0.0000 361.3704 0.4200 2.0458 0.9631 0.0000 411.8251 0.0005 7.0730 93.7710
temp: 298.150 k
press: 1.00000 atm
elementType: 9 9 9 9 7 7 6 6 6 6 6 6 6 6 6 6 6 6 1 1 1 1 1 1 1 1
symmnumber: 1
zpe: 467732.5 jmol-1
zpe.correction: 0.178150 hartree
zpe.thermalcorrener: 0.194069 hartree
zpe.thermalcorrenthalpy: 0.195013 hartree
zpe.thermalcorrgfe: 0.135119 hartree
zpe.sumelectzpe: -969.696966 hartree
zpe.sumelectthermal: -969.681047 hartree
zpe.sumelectthermalent: -969.680103 hartree
zpe.sumelectthermalfe: -969.739997 hartree
dipole: 0.0000 0.0001 0.0001
dipole: 0.0001
quadrupole: -69.9352 -107.7841 -105.8664
quadrupole: 0.0001 0.0064 0.0000
quadrupole: 24.5934 -13.2555 -11.3378 0.0001 0.0064 0.0000
hfenergy: -969.8751158 hartree
pointgroup: C01 [X(C12H8F4N2)]
dipole: -0.0000013 -0.0000337 0.0000334 debye
dipolederiv: -0.4988802 -0.3367051 0.0908373 -0.4778984 -0.7628471 0.1717201 0.1252572 0.1740348 -0.18594 -0.4988733 0.3367014 0.090846 0.4778943 -0.7628452 -0.1717366 0.1252696 -0.1740544 -0.1859493 -0.4989422 0.3367551 -0.090766 0.4779418 -0.7628419 0.1716116 -0.1251873 0.1739477 -0.1858882 -0.4989487 -0.3367548 -0.0907728 -0.47794 -0.7628276 -0.1716213 -0.1251999 -0.1739589 -0.1858952 -2.0342179 -0.0000361 0.0001061 -0.000076 -0.1722434 -0.1359785 0.0000014 -0.1369505 -0.6756407 -2.0342179 0.0000512 0.00009 0.0001022 -0.1722486 0.1359888 -0.0000673 0.1369609 -0.6756354 0.2668284 -0.0000073 -0.0000289 -0.0000181 -0.0470433 -0.0190027 -0.0000356 0.0037721 -0.0242324 0.2668283 0.0000054 -0.0000314 0.0000172 -0.0470439 0.0190028 -0.0000382 -0.0037726 -0.0242323 -0.0768931 -0.0385651 0.0022086 0.0460399 -0.0613966 -0.0406497 -0.0587687 -0.0247359 -0.1329755 -0.0768936 0.0385655 0.0022117 -0.0460385 -0.0613976 0.0406504 -0.0587679 0.0247367 -0.1329742 -0.0768945 0.0385623 -0.0022058 -0.0460489 -0.0613931 -0.0406359 0.0587703 -0.0247315 -0.1329912 -0.0768938 -0.0385613 -0.0022025 0.0460464 -0.0613932 0.0406371 0.0587729 0.0247305 -0.1329909 1.9053886 0.0000371 -0.0001566 0.0000598 -0.3011836 0.1134061 -0.0001361 0.1042444 0.0542362 1.9053888 -0.0000569 -0.0001382 -0.0000786 -0.3011784 -0.1134143 -0.0001031 -0.1042528 0.0542316 0.1236244 0.185515 -0.0467473 0.8852646 0.8754198 -0.2297642 -0.2708277 -0.2382333 0.1007582 0.1236167 -0.1855086 -0.0467577 -0.885253 0.8754165 0.2297851 -0.2708524 0.2382614 0.1007725 0.1237085 -0.1855882 0.0467166 -0.8853339 0.8754161 -0.229573 0.2708103 -0.2381685 0.1006845 0.1237157 0.185593 0.0467165 0.8853328 0.8753966 0.2295881 0.2708283 0.2381833 0.1006934 0.0966231 -0.0761071 0.0224771 -0.0674526 0.0223016 0.0461072 0.0213311 0.0391612 0.1521553 0.0966243 0.0761059 0.0224783 0.0674513 0.022302 -0.0461098 0.0213326 -0.0391629 0.152154 0.0966161 0.0761198 -0.0224687 0.0674678 0.0223038 0.0460914 -0.0213234 0.0391423 0.1521644 0.0966145 -0.0761206 -0.022471 -0.0674682 0.0223067 -0.0460942 -0.0213248 -0.0391454 0.152162 0.2865253 -0.0230936 0.0053459 -0.1253797 0.1867481 0.0545322 0.0308614 0.0540109 0.3888362 0.2865138 0.0231089 -0.0053178 0.1254168 0.1867601 0.0545178 -0.0307523 0.0540322 0.3888327 0.2865256 0.0230931 0.0053475 0.1253732 0.1867468 -0.0545337 0.0308841 -0.054009 0.3888362 0.2865132 -0.0231091 -0.005317 -0.1254218 0.1867655 -0.0545246 -0.0307344 -0.0540428 0.3888282 unknown
polarizability: 296.0663168|-0.0005722|140.9910753|-0.0222012|0.0008356|64.6417417 unknown
InChI: InChI=1S/C12H8F4N2/c13-7-1-5(2-8(14)11(7)17)6-3-9(15)12(18)10(16)4-6/h1-4H,17-18H2
charge 0 multiplicity 1
26 atoms
F  3.603156 2.323489 -0.618961
F  -3.603137 2.323499 0.619043
F  3.603338 -2.323564 0.618232
F  -3.603356 -2.323526 -0.618257
N  5.030663 -0.000008 -0.000472
N  -5.030663 0.00003 0.000475
C  0.742547 -0.000067 -0.000069
C  -0.742547 -0.000062 0.000092
C  1.478483 -1.179047 0.310819
C  -1.478491 -1.17903 -0.310822
C  1.47839 1.178936 -0.311066
C  -1.478382 1.178939 0.311115
C  3.647547 -0.000035 -0.000359
C  -3.647547 -0.000008 0.00038
C  2.873498 1.150821 -0.29913
C  -2.873491 1.150836 0.299177
C  2.873588 -1.150905 0.298583
C  -2.873596 -1.150878 -0.298584
H  0.973605 -2.106154 0.596033
H  -0.973621 -2.106136 -0.596053
H  0.973424 2.106035 -0.596158
H  -0.973406 2.106026 0.596228
H  5.538412 -0.851865 0.218227
H  5.538339 0.851836 -0.21939
H  -5.538414 -0.851827 -0.218217
H  -5.538338 0.851865 0.219435
