program: Gaussian 09
title: 000148452
version: EM64L-G09RevD.01
frameworkgroup: C1[X(C12H12O4)]
method: RPBEPBE
basis: SDD
operation: Freq
keyword: #pfreq=noraman
keyword: PBEPBE/SDD
title: #p freq=noraman PBEPBE/SDD
converged: YES YES NO NO
title: Mulliken charges:
elementType: O O O O C C C C C C C C C C C C H H H H H H H H H H H H
charge: -0.271663 -0.265902 -0.262377 -0.237912 0.554410 0.216712 0.158654 -0.574915 -0.625795 -0.367921 -0.328466 -0.201218 -0.184699 -0.101005 0.290647 -0.753235 0.255821 0.220220 0.226087 0.243287 0.249659 0.235403 0.237059 0.260500 0.274473 0.252819 0.252440 0.246914
chargesum: 0.00000
title: Mulliken charges with hydrogens summed into heavy atoms:
elementType: O O O O C C C C C C C C C C C C
charge: -0.271663 -0.265902 -0.262377 -0.237912 0.554410 0.216712 0.158654 -0.319094 -0.179487 -0.124634 -0.078807 0.271244 0.075802 0.173468 0.290647 -0.001061
polarizability: 2.39253940e+02 -7.59987711e+00 1.19387836e+02 -1.41314069e+01 2.04869032e+00 9.08598930e+01
1716.lowfreq: -53.1470 -2.4327 -0.0007 -0.0006 -0.0002 3.5808 7.6315 18.9957 25.9323
frequency: -53.1346 18.9085 25.8966 42.2148 63.0302 103.5557 109.8844 132.9180 202.2909 208.2690 227.4056 286.6437 313.3596 328.6847 392.8007 408.0291 419.0445 503.7703 523.1071 556.9938 584.8498 607.8950 635.1976 679.1106 717.4376 737.5251 775.7852 811.5406 830.4770 836.8412 843.1035 871.0655 897.4571 924.2807 939.2250 965.2146 977.4176 984.0181 1040.8226 1055.2734 1059.7913 1065.6290 1095.4822 1119.7478 1131.2644 1172.6968 1184.4773 1195.5943 1249.5167 1256.5559 1271.0189 1280.3109 1316.2324 1365.1465 1385.6634 1398.4693 1438.8871 1452.7121 1454.0517 1456.4686 1477.0549 1487.8915 1610.3986 1630.2314 1666.8036 1679.4056 2968.3998 3008.4689 3010.3246 3017.5382 3088.0808 3095.5167 3129.6172 3143.6919 3145.2232 3147.4615 3161.3132 3179.4189
redmass: 2.3384 5.2034 7.0486 2.3768 1.3991 4.2133 6.0946 2.8185 3.5883 4.6761 5.1587 4.9317 5.5115 2.9803 4.5923 4.6305 2.9509 3.2721 5.3473 3.1740 5.1134 5.2458 4.7578 9.5182 4.5811 4.6679 6.0945 1.4129 1.8035 4.6969 8.3543 1.4966 2.7758 2.4001 1.3844 1.1436 4.5030 2.1212 1.6417 4.1286 4.0127 1.4599 2.9587 1.0370 1.4164 1.5679 3.0271 1.3574 2.9640 1.6834 1.2784 1.2866 1.5159 1.2729 1.2422 3.7421 4.5194 1.0588 1.0465 1.1224 2.0839 1.3259 7.8252 8.1742 9.4808 6.4982 1.0593 1.0370 1.0536 1.1004 1.1187 1.0972 1.0925 1.0895 1.1009 1.0937 1.0928 1.0956
irintensity: 15.1849 0.1801 0.6820 3.4602 0.0603 0.7064 2.8917 2.5998 1.0365 3.0891 0.6094 1.3522 0.5612 0.2809 5.6662 7.2513 8.0038 0.6177 1.1847 1.7186 4.0272 15.6819 2.2512 0.2232 1.6394 4.4630 12.8402 42.8403 9.4213 75.8756 24.1988 20.2509 2.8691 8.8509 6.9657 78.7834 162.3948 7.9550 9.4203 207.2846 130.5842 4.1708 34.4093 0.0170 16.1415 120.4969 382.5156 87.2896 166.5507 28.6111 2.5581 4.5069 1.7063 0.8567 59.1160 12.1077 28.4588 25.9810 18.5789 29.4620 144.3534 34.2992 7.4654 0.1346 242.1427 31.4052 27.8916 1.5023 135.3241 15.5615 34.9807 6.5230 7.0350 9.2429 14.4072 22.5356 4.1116 4.2619
temp: 298.150 k
press: 1.00000 atm
elementType: 8 8 8 8 6 6 6 6 6 6 6 6 6 6 6 6 1 1 1 1 1 1 1 1 1 1 1 1
symmnumber: 1
zpe: 559720.1 jmol-1
zpe.correction: 0.213186 hartree
zpe.thermalcorrener: 0.227821 hartree
zpe.thermalcorrenthalpy: 0.228765 hartree
zpe.thermalcorrgfe: 0.168452 hartree
zpe.sumelectzpe: -764.158575 hartree
zpe.sumelectthermal: -764.143940 hartree
zpe.sumelectthermalent: -764.142996 hartree
zpe.sumelectthermalfe: -764.203310 hartree
dipole: 0.6138 0.1492 -1.7629
dipole: 1.8726
quadrupole: -81.9644 -91.2329 -96.0571
quadrupole: -3.7861 10.0084 -1.0864
quadrupole: 7.7871 -1.4814 -6.3056 -3.7861 10.0084 -1.0864
hfenergy: -764.3717616 hartree
pointgroup: C01 [X(C12H12O4)]
dipole: 0.2328452 0.1082656 0.6905353 debye
polarizability: 238.688306|12.2944065|119.0555706|13.5692715|-4.3785412|91.7577926 unknown
InChI: InChI=1S/C12H12O4/c1-9(13)14-6-2-3-10-4-5-11-12(7-10)16-8-15-11/h2,4-7H,3,8H2,1H3
charge 0 multiplicity 1
28 atoms
O  4.472694 1.093235 0.094495
O  4.438481 -1.30085 0.324027
O  -3.942946 0.106688 0.517334
O  -5.317327 -0.405942 -1.311176
C  0.757041 0.626634 -0.357161
C  3.148573 0.600955 -0.03343
C  3.128497 -0.802148 0.10199
C  1.987596 1.341725 -0.262274
C  -0.540127 1.389705 -0.646385
C  0.748014 -0.784506 -0.215809
C  1.938187 -1.527198 0.015876
C  5.319768 -0.102768 0.353791
C  -1.716529 0.936005 0.19397
C  -2.87784 0.498554 -0.342702
C  -5.151509 -0.340579 -0.076439
C  -6.142348 -0.702826 1.002646
H  2.022992 2.430597 -0.362932
H  -0.361518 2.469069 -0.468225
H  -0.79994 1.29294 -1.719912
H  -0.206687 -1.317344 -0.28316
H  1.925131 -2.614846 0.122216
H  5.770456 -0.012362 1.357873
H  6.072189 -0.189827 -0.448582
H  -1.605563 0.970378 1.285346
H  -3.092449 0.41471 -1.414182
H  -6.333171 0.169343 1.65161
H  -5.730507 -1.502106 1.643066
H  -7.08266 -1.040336 0.544327
