program: Gaussian 09
title: 000148459
version: EM64L-G09RevD.01
frameworkgroup: C1[X(C12H19NO4)]
method: RPBEPBE
basis: SDD
operation: Freq
keyword: #p
keyword: freq=noraman
keyword: PBEPBE/SDD
title: #p freq=noraman PBEPBE/SDD
converged: YES YES NO NO
title: Mulliken charges:
elementType: O O O O N C C C C C C C C C C C C H H H H H H H H H H H H H H H H H H H
charge: -0.268954 -0.305579 -0.300375 -0.453444 -0.287459 -0.591696 -0.042172 0.426351 0.161712 -0.703452 -0.526286 0.198655 -0.507370 0.202288 -0.536889 -0.529027 -0.530911 0.263512 0.196737 0.225652 0.225027 0.221207 0.222494 0.258177 0.268388 0.261034 0.359333 0.222739 0.244700 0.221043 0.221773 0.248954 0.228009 0.257746 0.227670 0.220413
chargesum: 0.00000
title: Mulliken charges with hydrogens summed into heavy atoms:
elementType: O O O O N C C C C C C C C C C C C
charge: -0.268954 -0.305579 -0.300375 -0.094110 -0.019071 -0.131447 0.183480 0.426351 0.161712 -0.034725 -0.268109 0.198655 -0.246336 0.202288 0.151594 0.169709 0.174918
polarizability: 2.04742692e+02 -7.86071160e+00 1.65074649e+02 5.01154133e+00 3.89793046e+00 1.06272205e+02
1716.lowfreq: -8.0369 -3.4057 -0.0006 0.0004 0.0005 4.3417 27.1680 38.3453 43.7297
frequency: 26.7142 38.2379 43.7277 62.8059 83.4804 103.4686 113.7362 122.7822 147.0460 160.7176 171.2573 193.7486 194.5734 215.3183 234.0785 245.7896 266.8452 281.7152 292.7250 323.5955 343.8144 350.1080 364.1879 423.9251 450.4579 476.6481 485.2980 501.4217 540.7929 586.1529 668.8877 699.7687 713.4253 734.3259 768.0696 813.0833 845.6885 854.7230 897.2479 900.7764 910.2590 917.4124 955.5761 975.8722 989.2811 1067.6044 1082.3762 1097.3837 1113.2835 1113.7934 1114.9605 1148.4405 1149.0402 1154.4371 1159.3535 1169.1043 1173.2120 1215.8983 1242.7944 1253.8257 1279.0795 1290.5784 1323.2473 1357.6629 1368.4053 1378.0659 1380.4772 1423.2475 1435.0333 1437.4440 1446.8715 1456.7691 1458.6740 1463.3232 1467.2180 1468.6468 1472.6736 1477.1902 1482.4888 1487.7930 1493.5564 1575.6213 1613.6075 2922.6980 2958.8065 2967.7860 2968.3429 2972.4533 2991.0528 3046.3969 3062.7825 3070.5951 3077.6067 3093.4733 3095.5543 3117.1601 3120.9602 3123.2121 3140.4435 3173.6571 3325.7459 3554.7696
redmass: 3.2342 4.2115 4.3981 3.2035 3.6257 2.7719 3.6051 3.9321 2.0169 1.4662 1.1089 3.0919 2.1285 1.3090 2.5423 1.7813 3.4273 3.7598 3.2763 2.8089 1.2009 4.5142 3.8871 3.8052 2.3588 4.3606 4.5334 3.5726 5.1189 4.1492 5.2797 6.8380 6.3333 2.7037 3.8857 3.4088 2.4522 1.8054 1.4408 1.5374 5.9465 2.7769 5.9408 1.9079 4.8772 1.6222 5.1767 1.7242 1.2595 1.2448 1.2436 1.4992 1.5152 1.8949 1.4512 1.6682 3.1576 1.4261 1.3376 1.2512 1.2942 5.3785 1.4531 1.3131 6.1461 1.3145 2.9678 1.1834 1.1884 1.1971 1.3254 1.0579 1.0633 1.0571 1.0534 1.1015 1.1581 1.0555 1.0605 1.0525 2.3851 9.1587 7.1080 1.0829 1.0329 1.0311 1.0666 1.0315 1.0351 1.1038 1.1042 1.1029 1.0933 1.1002 1.0994 1.1023 1.1031 1.0995 1.0916 1.0906 1.0751 1.0681
irintensity: 0.0611 0.0269 0.8839 4.2803 1.3464 6.8843 0.1294 3.9434 3.7774 1.4691 0.0613 5.5640 3.6807 1.6069 3.4873 4.3170 10.9938 1.4603 3.7521 2.0833 105.3383 12.5663 8.5947 3.4395 24.6179 1.8214 3.9006 10.0045 8.0299 21.1148 15.3799 4.1281 8.1545 8.0307 9.3480 29.2900 14.1752 26.3311 18.5754 6.4971 37.3601 18.8685 99.4328 56.3716 52.6567 10.8647 43.1671 2.5452 0.5233 15.3929 1.9774 36.5226 11.6101 7.1947 2.3993 113.1937 132.2758 20.4228 24.6095 23.6228 33.1217 37.5127 5.1051 2.7790 20.8148 34.2710 32.2462 5.4367 5.7338 19.4281 10.8413 14.0772 13.0865 12.5997 10.6253 13.8170 109.4845 4.0187 19.1985 21.9486 141.9001 7.6691 17.3389 46.6343 70.9089 81.1578 32.8112 75.4017 16.9842 45.7971 30.2954 25.6273 4.6637 27.9689 30.8273 28.4567 24.3373 21.6754 5.3314 3.1735 6.8485 19.8542
temp: 298.150 k
press: 1.00000 atm
elementType: 8 8 8 8 7 6 6 6 6 6 6 6 6 6 6 6 6 1 1 1 1 1 1 1 1 1 1 1 1 1 1 1 1 1 1 1
symmnumber: 1
zpe: 774978.2 jmol-1
zpe.correction: 0.295174 hartree
zpe.thermalcorrener: 0.314818 hartree
zpe.thermalcorrenthalpy: 0.315762 hartree
zpe.thermalcorrgfe: 0.246409 hartree
zpe.sumelectzpe: -822.879583 hartree
zpe.sumelectthermal: -822.859939 hartree
zpe.sumelectthermalent: -822.858995 hartree
zpe.sumelectthermalfe: -822.928348 hartree
dipole: 1.6749 1.8091 0.3527
dipole: 2.4905
quadrupole: -95.7709 -93.0102 -101.8004
quadrupole: -3.8224 -1.1743 -0.1934
quadrupole: 1.0896 3.8503 -4.9399 -3.8224 -1.1743 -0.1934
hfenergy: -823.1747567 hartree
pointgroup: C01 [X(C12H19N1O4)]
dipole: 0.6732602 -0.6923867 -0.1654833 debye
polarizability: 204.6147523|8.6298075|164.730581|-2.8556032|7.2196768|106.7442133 unknown
InChI: InChI=1S/C12H19NO4/c1-8(13-14)5-9-6-11(16-3)12(17-4)7-10(9)15-2/h6-8,13-14H,5H2,1-4H3
charge 0 multiplicity 1
36 atoms
O  -0.87084 -2.459795 0.079104
O  2.28404 2.200767 0.61397
O  3.493463 -0.279079 -0.392701
O  -5.157577 1.70085 -0.195466
N  -4.355487 0.716668 0.61951
C  -2.105017 -0.111689 1.079883
C  -2.976475 0.646576 0.034074
C  -0.634361 -0.151375 0.699089
C  -0.026332 -1.339226 0.194715
C  -3.026656 -0.057768 -1.32998
C  0.174876 1.000398 0.814557
C  1.538862 1.003578 0.45513
C  1.346631 -1.363312 -0.147038
C  2.134024 -0.200334 -0.00746
C  -0.280945 -3.704586 -0.414565
C  2.755587 2.787856 -0.661653
C  4.46182 0.001634 0.6939
H  -2.500004 -1.135087 1.190459
H  -2.208457 0.398592 2.060423
H  -2.561165 1.671483 -0.103286
H  -3.646678 0.522452 -2.035305
H  -3.453091 -1.070908 -1.221265
H  -2.011645 -0.1496 -1.753374
H  -0.254168 1.936043 1.191119
H  -4.301747 1.192389 1.541764
H  1.842355 -2.26548 -0.514775
H  -5.888937 1.132132 -0.550464
H  0.119247 -3.582104 -1.439842
H  -1.106897 -4.431035 -0.422999
H  0.524505 -4.062705 0.256173
H  1.892488 3.072735 -1.293272
H  3.399688 2.075571 -1.209443
H  3.326626 3.686044 -0.38018
H  4.284448 0.99953 1.132742
H  5.454234 -0.044426 0.219928
H  4.383084 -0.773191 1.480228
