program: Gaussian 09
title: 000148421
version: EM64L-G09RevD.01
frameworkgroup: C1[X(C15H20O4)]
method: RPBEPBE
basis: SDD
operation: Freq
keyword: #pfreq=noraman
keyword: PBEPBE/SDD
title: #p freq=noraman PBEPBE/SDD
converged: YES YES NO NO
title: Mulliken charges:
elementType: O O O O C C C C C C C C C C C C C C C H H H H H H H H H H H H H H H H H H H H
charge: -0.426294 -0.224400 -0.444579 -0.428268 0.169039 -0.255277 0.248895 -0.028027 -0.026114 -0.424903 -0.782931 0.177550 -0.653907 0.246090 0.367167 -0.610523 -0.849525 -0.852097 -0.340346 0.289820 0.232785 0.210184 0.247005 0.221975 0.247106 0.273574 0.340842 0.249721 0.216252 0.236746 0.299344 0.235945 0.246123 0.237444 0.230603 0.361221 0.196505 0.230339 0.334916
chargesum: 0.00000
title: Mulliken charges with hydrogens summed into heavy atoms:
elementType: O O O O C C C C C C C C C C C C C C C
charge: -0.085452 -0.224400 -0.083358 -0.093352 0.169039 0.034544 0.248895 -0.028027 -0.026114 0.018066 -0.066845 0.177550 -0.380333 0.246090 0.367167 -0.144549 -0.077490 -0.137927 0.086497
polarizability: 2.37088415e+02 -8.30834682e+00 1.83196369e+02 1.12915252e+00 6.09501709e+00 1.18732777e+02
1716.lowfreq: -12.6500 -2.8410 -0.0007 -0.0005 0.0007 5.8037 38.2118 51.4652 58.8157
frequency: 38.0852 51.4372 58.8002 77.7358 92.3262 127.5079 132.7961 141.4551 153.0703 164.3190 170.2235 187.9514 205.9985 235.7133 253.1560 267.3438 275.3426 285.1577 303.4843 314.2103 346.5488 350.8158 368.0681 377.2045 389.7400 440.0096 469.5440 473.4829 496.7233 529.9013 539.1640 565.5675 586.8201 646.1761 681.9477 695.0180 729.3492 775.2149 798.1107 805.5532 846.1176 890.0060 902.8342 929.4447 958.0109 961.1955 965.5981 989.0414 998.3048 1007.3663 1013.9764 1038.1184 1042.4548 1055.2288 1067.7338 1089.8246 1100.9211 1121.8610 1140.7906 1199.8652 1206.9297 1218.9372 1229.6567 1236.4029 1262.9621 1283.7272 1287.4920 1307.0048 1337.0413 1339.9946 1359.4869 1367.0397 1373.5155 1381.1794 1387.1038 1398.3471 1400.7444 1420.8587 1424.2051 1455.8683 1466.7042 1470.7582 1475.0612 1477.2547 1480.6669 1485.2397 1493.9520 1500.9894 1583.7353 1593.5040 1616.0843 2963.9733 2975.0912 2976.0285 2977.2728 2985.7758 2999.6308 3028.3093 3050.9849 3052.5885 3060.4033 3069.9155 3075.1968 3085.4485 3085.8163 3089.9450 3111.5387 3140.9767 3544.4536 3549.0387 3561.9405
redmass: 5.2954 4.8528 5.6887 4.2931 4.5210 2.4599 2.9683 1.0297 1.2405 3.0829 3.7233 3.5306 2.6506 2.8164 1.2729 2.8628 2.5825 3.4651 3.4042 1.4481 3.1740 2.1081 2.3042 2.6091 2.3196 4.2052 1.9990 2.1761 2.8697 4.7007 3.1849 3.7260 5.5072 4.0731 4.0034 4.1310 5.5021 4.0439 1.2455 3.9628 2.8956 2.6595 1.3927 2.4091 3.9382 2.6294 1.7425 2.0241 3.2818 1.5694 3.2163 1.6222 1.6506 3.1326 1.8613 2.7617 2.7220 1.7605 1.3197 2.4528 1.3977 1.5549 2.5869 1.8480 1.3996 2.0274 1.2144 5.6950 1.3165 1.2311 1.2098 1.2016 1.2064 2.2936 1.5255 1.3167 1.2636 2.4631 3.2483 1.0790 1.2950 1.1115 1.0606 1.1632 1.1084 1.0582 1.0628 1.0881 8.0281 7.6989 8.6534 1.0687 1.0388 1.0357 1.0408 1.0631 1.0628 1.0843 1.0961 1.0942 1.0944 1.0992 1.1010 1.0986 1.0998 1.0981 1.0982 1.0919 1.0658 1.0658 1.0662
irintensity: 0.5184 1.2163 4.9053 0.5212 3.2230 5.7635 2.8586 1.1295 1.1474 0.1695 2.1647 1.3342 2.7162 1.7781 4.4061 3.6495 13.4678 0.6972 8.0633 134.0892 3.0178 19.3720 36.3015 21.2028 86.7954 8.9902 96.9596 63.8930 116.9109 1.2379 2.6404 5.8486 3.0926 0.4280 2.8521 5.3921 7.9864 6.6347 5.3972 10.9915 6.1432 24.1894 5.0236 60.3767 84.8547 29.6557 34.0289 89.6201 82.0755 3.9048 52.8868 0.7347 6.3874 28.5043 8.4663 44.6769 11.8446 12.7945 36.9083 1.9882 13.1696 6.7100 41.2700 13.2467 30.5213 6.3750 4.1170 38.8793 10.5869 23.6851 20.1698 37.4800 28.1353 5.6375 28.8289 14.9102 37.5473 1.9348 27.7191 9.1252 30.0351 14.6164 15.1992 13.8762 12.2033 11.2789 26.2367 3.5989 8.2256 265.1793 31.0267 47.9106 24.8682 15.9583 23.9866 63.8201 38.5621 3.1840 13.8645 19.3405 7.3175 33.8917 8.0331 28.2867 19.3031 13.7186 0.9553 6.4229 8.8334 5.5660 10.4026
temp: 298.150 k
press: 1.00000 atm
elementType: 8 8 8 8 6 6 6 6 6 6 6 6 6 6 6 6 6 6 6 1 1 1 1 1 1 1 1 1 1 1 1 1 1 1 1 1 1 1 1
symmnumber: 1
zpe: 841133.5 jmol-1
zpe.correction: 0.320371 hartree
zpe.thermalcorrener: 0.340571 hartree
zpe.thermalcorrenthalpy: 0.341515 hartree
zpe.thermalcorrgfe: 0.272599 hartree
zpe.sumelectzpe: -883.040817 hartree
zpe.sumelectthermal: -883.020617 hartree
zpe.sumelectthermalent: -883.019672 hartree
zpe.sumelectthermalfe: -883.088589 hartree
dipole: -2.8792 3.2867 -3.3122
dipole: 5.4829
quadrupole: -115.5076 -119.0794 -116.2932
quadrupole: -12.4035 -6.2109 -1.7492
quadrupole: 1.4524 -2.1193 0.6669 -12.4035 -6.2109 -1.7492
hfenergy: -883.3611874 hartree
pointgroup: C01 [X(C15H20O4)]
dipole: -0.9543151 1.1544818 -1.5523441 debye
polarizability: 235.0618146|-9.207256|184.158193|13.7728095|-2.7862108|119.7975532 unknown
InChI: InChI=1S/C15H20O4/c1-8-6-11-12(9(2)10(8)4-5-16)14(19)15(3,7-17)13(11)18/h6,13,16-18H,4-5,7H2,1-3H3
charge 0 multiplicity 1
39 atoms
O  2.753072 2.316715 0.102374
O  1.712461 -2.48943 0.331299
O  3.311879 -1.046332 2.519735
O  -5.583487 -1.019386 0.286528
C  2.789241 -0.253307 0.210929
C  2.119441 1.103659 0.626328
C  0.661588 0.927364 0.223541
C  0.344038 -0.441337 0.011786
C  1.58746 -1.235753 0.189406
C  3.875365 -0.725032 1.203221
C  3.385798 -0.171576 -1.219717
C  -0.980241 -0.857202 -0.302401
C  -0.324381 1.915093 0.096785
C  -1.982554 0.153001 -0.425552
C  -1.651977 1.537007 -0.232547
C  -3.421266 -0.248884 -0.723902
C  -1.296395 -2.325753 -0.529768
C  -2.703711 2.623777 -0.3834
C  -4.230506 -0.525509 0.57264
H  2.207156 1.215855 1.722841
H  4.592229 0.094011 1.384363
H  4.41629 -1.595752 0.780799
H  3.720391 -1.170633 -1.549647
H  2.646061 0.192283 -1.957561
H  4.256813 0.508748 -1.228363
H  -0.073552 2.968378 0.261739
H  2.627041 2.345084 -0.880533
H  -3.458315 -1.165055 -1.33858
H  -3.937135 0.542681 -1.300575
H  -1.57869 -2.512003 -1.58433
H  -0.426352 -2.953899 -0.288194
H  -2.147769 -2.66112 0.090054
H  -2.288583 3.610765 -0.120807
H  -3.076927 2.684972 -1.424068
H  -3.581754 2.446853 0.264789
H  2.820502 -1.904098 2.433974
H  -4.262771 0.382554 1.211561
H  -3.7608 -1.33458 1.15513
H  -6.09076 -0.319461 -0.197079
