program: Gaussian 09
title: 000148415
version: EM64L-G09RevD.01
frameworkgroup: C1[X(C14H10Cl2O4)]
method: RPBEPBE
basis: SDD
operation: Freq
keyword: #p
keyword: freq=noraman
keyword: PBEPBE/SDD
title: #p freq=noraman PBEPBE/SDD
converged: YES YES NO NO
title: Mulliken charges:
elementType: Cl Cl O O O O C C C C C C C C C C C C C C H H H H H H H H H H
charge: 0.035305 0.035302 -0.293582 -0.293581 -0.178829 -0.178828 0.329078 0.329064 0.351909 0.351891 -0.388659 -0.388636 -0.394240 -0.394290 -0.235957 -0.235962 0.253155 0.253148 -0.740687 -0.740683 0.263162 0.263157 0.235581 0.235582 0.251131 0.251201 0.261470 0.261469 0.251203 0.251126
chargesum: 0.00000
title: Mulliken charges with hydrogens summed into heavy atoms:
elementType: Cl Cl O O O O C C C C C C C C C C C C C C
charge: 0.035305 0.035302 -0.293582 -0.293581 -0.178829 -0.178828 0.329078 0.329064 0.351909 0.351891 -0.125497 -0.125479 -0.394240 -0.394290 -0.000375 -0.000380 0.253155 0.253148 0.023114 0.023115
polarizability: 2.33112196e+02 4.59054030e-03 2.39013348e+02 -1.46199401e-03 -4.99913780e-01 1.03081589e+02
1716.lowfreq: -6.7897 -6.5906 -0.0020 -0.0015 -0.0010 3.6561 32.0455 36.8577 37.9015
frequency: 31.9803 36.8374 37.8359 55.7144 58.6296 70.7744 83.0212 84.1505 94.3141 95.8042 160.0472 198.8086 198.8349 206.8225 261.3741 270.5979 287.4261 321.8968 323.1927 360.7797 363.3182 394.3486 439.8684 492.2366 518.1830 534.0913 539.9733 542.5816 571.7291 617.9642 622.9257 645.4903 687.0799 696.3617 734.9979 768.9207 793.4240 805.1113 827.1606 859.3200 869.7493 900.8355 975.3219 982.3901 983.5450 1000.4672 1023.1339 1037.4658 1038.6650 1042.7012 1050.5285 1136.4231 1155.2723 1162.7033 1176.0742 1260.9973 1262.2850 1348.4457 1357.8557 1384.1198 1384.2140 1401.7694 1428.7455 1430.4120 1451.5102 1451.6293 1451.9563 1452.0747 1498.5254 1571.0015 1576.4136 1627.5684 1699.9291 1702.5709 3009.7491 3009.7502 3099.5640 3099.5785 3138.1467 3146.5567 3146.5854 3153.8123 3169.3105 3177.5115
redmass: 8.3253 7.4722 6.1995 2.0647 2.0882 10.0136 1.3354 1.4067 8.2792 6.1068 5.7066 6.3190 25.1474 8.7378 3.8367 10.2947 7.1723 10.4765 6.9733 9.6401 4.9879 7.9705 3.4881 4.6078 5.1090 4.3842 3.2301 3.2732 6.6070 7.9094 7.2750 7.7509 6.2982 4.9075 6.8351 2.1358 2.9238 6.2667 2.8113 6.5963 7.8717 2.1311 1.3846 2.2586 2.1112 1.3418 3.0506 1.9208 1.6622 4.3567 3.6779 2.0873 2.6190 1.9681 1.1499 6.8474 1.6772 3.6645 5.5539 1.2407 1.2433 3.8114 2.8457 10.3959 1.0502 1.0521 1.0519 1.0522 3.8450 8.8417 8.5676 6.7666 10.6933 10.7081 1.0373 1.0373 1.0961 1.0961 1.0860 1.1017 1.1017 1.0898 1.0949 1.0998
irintensity: 0.0181 0.9009 0.8570 6.7278 0.2101 0.2749 0.7584 0.0290 2.8190 0.5321 0.3843 0.1719 0.1410 0.0568 4.6606 1.6827 0.1311 1.2125 1.5515 7.0929 0.1038 0.2507 4.9115 2.9298 34.3931 1.1451 1.1248 2.9690 0.0002 12.8035 21.4268 5.8222 8.9820 14.9388 8.6431 136.3257 27.2290 24.0642 11.5051 132.9615 66.0128 6.3669 0.1315 210.8350 25.6782 0.3512 12.1268 49.9197 9.7737 110.4712 32.3211 395.4873 178.4723 231.6431 8.6994 58.5439 2.3822 124.7033 12.2044 7.5912 107.1321 5.4171 20.5649 1.5586 0.9783 38.5750 2.2738 43.2798 17.2092 44.9341 3.7322 0.0023 2.7917 317.5217 0.7088 0.6379 3.2509 5.7671 3.0448 7.4022 9.6090 7.7174 11.4383 21.5058
temp: 298.150 k
press: 1.00000 atm
elementType: 17 17 8 8 8 8 6 6 6 6 6 6 6 6 6 6 6 6 6 6 1 1 1 1 1 1 1 1 1 1
symmnumber: 1
zpe: 539048.0 jmol-1
zpe.correction: 0.205313 hartree
zpe.thermalcorrener: 0.224916 hartree
zpe.thermalcorrenthalpy: 0.225860 hartree
zpe.thermalcorrgfe: 0.154406 hartree
zpe.sumelectzpe: -1759.090511 hartree
zpe.sumelectthermal: -1759.070907 hartree
zpe.sumelectthermalent: -1759.069963 hartree
zpe.sumelectthermalfe: -1759.141417 hartree
dipole: 0.0003 3.1559 -2.5680
dipole: 4.0687
quadrupole: -93.3314 -117.1449 -143.0444
quadrupole: -0.0010 -0.0007 1.6538
quadrupole: 24.5088 0.6953 -25.2042 -0.0010 -0.0007 1.6538
hfenergy: -1759.2958231 hartree
pointgroup: C01 [X(C14H10Cl2O4)]
dipole: -0.0002535 -1.2319082 -1.0221643 debye
polarizability: 233.1121974|0.0054897|238.9912954|0.0091589|1.8018892|103.1036407 unknown
InChI: InChI=1S/C14H10Cl2O4/c1-7(17)19-13-9-5-3-4-6-10(9)14(20-8(2)18)12(16)11(13)15/h3-6H,1-2H3
charge 0 multiplicity 1
30 atoms
Cl 1.624882 2.955547 -0.376733
Cl -1.623277 2.956394 -0.377086
O  2.829724 0.183929 -0.374544
O  -2.829575 0.185248 -0.37485
O  3.077689 0.690238 1.910461
O  -3.077633 0.691281 1.910214
C  0.722426 -1.06277 -0.275181
C  -0.722914 -1.06241 -0.27528
C  1.41363 0.192159 -0.293021
C  -1.413487 0.19286 -0.293188
C  1.421867 -2.312099 -0.254579
C  -1.422996 -2.31138 -0.254757
C  0.714539 1.401393 -0.319492
C  -0.713773 1.401756 -0.319582
C  0.714466 -3.515072 -0.228868
C  -0.71621 -3.514711 -0.228953
C  3.595951 0.51352 0.799862
C  -3.595805 0.515062 0.799496
C  5.051952 0.601498 0.419258
C  -5.05171 0.603718 0.41869
H  2.515245 -2.304526 -0.266681
H  -2.516369 -2.303245 -0.26699
H  1.254968 -4.467156 -0.210977
H  -1.257197 -4.466521 -0.21113
H  5.346665 -0.262592 -0.198653
H  5.671842 0.654921 1.325469
H  5.212459 1.51025 -0.188168
H  -5.211604 1.51212 -0.189415
H  -5.671652 0.65813 1.324804
H  -5.346903 -0.260641 -0.198626
