program: Gaussian 09
title: 000148424
version: EM64L-G09RevD.01
frameworkgroup: C1[X(C20H25N3O7)]
method: RPBEPBE
basis: SDD
operation: Freq
keyword: #p
keyword: freq=noraman
keyword: PBEPBE/SDD
title: #p freq=noraman PBEPBE/SDD
converged: YES YES NO NO
title: Mulliken charges:
elementType: O O O O O O O N N N C C C C C C C C C C C C C C C C C C C C H H H H H H H H H H H H H H H H H H H H H H H H H
charge: -0.280374 -0.180800 -0.215272 -0.220421 -0.178063 -0.216868 -0.197307 -0.404076 -0.051111 0.049238 -0.376551 -0.373006 -0.377449 -0.351666 -0.393228 -0.356786 -0.270995 -0.695338 0.175235 0.224730 -0.382727 0.030110 0.278381 -0.352843 0.401383 0.214331 -0.348534 0.267205 -0.306954 -0.797519 0.194287 0.194514 0.190988 0.191038 0.196736 0.196785 0.188450 0.188477 0.213112 0.212938 0.195338 0.195373 0.232052 0.231418 0.209987 0.216236 0.209993 0.294464 0.354715 0.246408 0.276980 0.295157 0.242589 0.244197 0.275042
chargesum: 0.00000
title: Mulliken charges with hydrogens summed into heavy atoms:
elementType: O O O O O O O N N N C C C C C C C C C C C C C C C C C C C C
charge: -0.280374 -0.180800 -0.215272 -0.220421 -0.178063 -0.216868 -0.197307 -0.049361 -0.051111 0.049238 0.012250 0.009019 0.016072 0.025261 0.032822 0.033924 0.192475 -0.059122 0.175235 0.224730 -0.088262 0.030110 0.278381 -0.106434 0.401383 0.214331 -0.071553 0.267205 -0.011798 -0.035690
polarizability: 4.53994161e+02 -1.10112196e+02 5.34847140e+02 -6.56380677e-01 -1.89985012e-01 1.42668482e+02
1716.lowfreq: -27.3179 -10.0539 -0.9177 -0.0017 -0.0006 0.0018 2.4780 7.0365 11.7311
frequency: -27.3123 -3.3449 11.5966 24.5368 28.4309 32.1356 36.7787 43.8731 48.8517 53.3866 59.4199 68.3638 78.6738 82.4077 92.1819 98.3515 112.1086 120.7101 135.6019 137.2237 142.6239 151.9240 175.1987 179.7945 193.7917 218.0789 223.4368 226.5444 230.1290 275.9392 280.6369 315.7011 319.2475 341.6964 364.1253 392.5103 425.0944 436.8617 453.5484 466.8612 488.9198 526.6223 545.3041 562.5098 566.7490 578.2596 610.0623 644.1654 677.8897 681.4737 698.4540 708.8858 722.5560 730.4743 734.3280 752.2970 752.5455 759.6487 782.4197 794.7114 817.0096 839.4015 858.5586 862.8579 875.0430 887.0831 900.3308 908.8307 919.1824 921.1478 936.6779 937.3727 937.8234 976.9669 993.5595 1008.7017 1018.0904 1021.7445 1033.2612 1038.3496 1050.0515 1075.6999 1077.8919 1085.5747 1102.8550 1125.2251 1131.9261 1144.2277 1149.4996 1170.0857 1182.9720 1187.8576 1217.6669 1218.4030 1222.7830 1238.8780 1257.8116 1261.8113 1263.0947 1277.0536 1282.9110 1292.8841 1296.7213 1303.6273 1318.0192 1333.4219 1335.9403 1343.6645 1352.3191 1354.8427 1372.8913 1375.5422 1381.2224 1389.8869 1425.2697 1441.2345 1460.5155 1462.3493 1463.2636 1466.5228 1467.9164 1469.6862 1475.0119 1476.6509 1480.9141 1486.9564 1490.0098 1492.8492 1540.5121 1552.3503 1561.1010 1601.0026 1643.4214 1660.8232 2951.4940 2953.3332 2957.3817 2963.9156 2968.9026 2972.2630 2985.3554 2989.3608 2989.9087 2994.2360 3001.5113 3007.2429 3022.8395 3034.3080 3036.8672 3046.9301 3068.4871 3071.3997 3074.4291 3075.8556 3140.0948 3242.2432 3242.8346 3261.0823 3455.3328
redmass: 1.0863 5.4948 5.0247 7.6580 5.9997 5.3532 2.7585 2.2477 5.1148 4.8188 4.9826 4.0819 6.0832 2.0970 4.7378 2.8607 5.5664 2.2624 3.1214 5.9869 2.6283 3.0006 5.4195 7.0866 5.1519 5.4102 5.8467 9.0659 1.1228 3.9429 4.9187 3.3320 3.9162 6.1042 4.2885 5.3951 8.6578 4.7170 8.4784 3.7697 3.9446 7.9350 5.4712 5.9255 3.2023 5.4164 4.8586 4.3169 8.8105 7.2947 4.0544 5.2770 1.0618 1.0803 12.2791 6.9987 1.1386 1.3918 5.4058 1.1628 1.3205 5.9637 1.2134 1.4429 7.0970 2.1844 4.7767 1.3737 7.1260 5.9946 1.1975 1.5608 5.1067 1.9151 4.5029 1.1117 1.2450 3.6796 1.6647 4.7851 3.8508 2.4280 2.3061 2.3449 4.7430 2.9762 5.5930 1.7994 1.4383 3.2524 2.9068 1.6652 1.8386 1.3490 1.3875 4.5514 1.2554 4.7652 1.4171 1.0866 1.0772 1.1138 1.1008 1.3288 4.2070 2.8431 1.4463 7.2714 1.6324 1.5935 1.7126 3.1906 1.2401 1.2164 2.4219 2.2176 1.3917 1.0729 1.0741 1.0468 1.0690 1.0826 1.0794 1.0424 1.0816 1.0923 1.1176 4.8394 6.8355 7.0720 6.5651 7.7550 9.7427 7.1968 1.0587 1.0587 1.0591 1.0590 1.0584 1.0368 1.0968 1.0596 1.0386 1.0991 1.0565 1.1020 1.1038 1.0879 1.1042 1.1045 1.1007 1.0993 1.0982 1.1081 1.0981 1.0944 1.0987 1.1046 1.0759
irintensity: 1.4898 0.1337 0.1657 5.8738 2.0617 0.0103 0.5802 1.7419 2.0787 2.2143 1.7594 1.4779 3.7061 0.0052 0.0027 0.0538 0.5135 0.0500 0.2874 1.6575 0.1000 0.0259 0.0018 3.8224 5.2625 0.5188 9.2559 1.5477 0.0277 1.7947 14.0076 7.1445 12.5283 0.8147 1.0858 2.4580 0.0055 7.2868 0.3426 2.7248 6.6660 7.9958 12.9321 0.6493 0.1799 1.3806 11.9735 0.6093 9.3259 6.0525 7.5579 14.0048 14.7463 0.1023 13.5030 0.2056 2.8182 78.4471 7.3538 0.2958 61.1283 12.3380 0.1297 23.6751 27.4695 1.8904 16.0722 3.9435 0.7181 6.5228 1.8296 23.2653 3.4654 180.7467 1.6644 0.0656 35.4258 1.0713 9.3122 345.5574 212.6934 17.7607 1.3099 41.7166 102.1483 0.0053 214.0233 314.1309 1.5701 134.0670 241.4020 0.0021 301.4982 57.5140 0.1781 249.0338 0.1317 573.2018 54.2997 0.1701 0.6769 0.1118 0.0491 1.6253 77.1314 85.3627 3.2291 90.4446 1.1187 0.2161 0.6045 31.1029 61.8013 11.4800 57.3085 150.6369 16.4481 0.0247 0.0090 21.6987 0.9811 0.7130 4.1198 12.5183 0.6896 8.2294 4.9275 492.1464 140.0674 508.9232 448.6831 282.4401 346.6079 325.1287 0.2724 1.3686 1.0909 21.0828 144.5182 34.0117 0.0068 15.6321 4.2580 0.2434 42.5044 0.9904 0.0036 24.2374 69.6047 56.4385 89.8958 55.5941 10.4946 77.7565 7.7337 0.4651 3.5510 5.1528 17.2977
temp: 298.150 k
press: 1.00000 atm
elementType: 8 8 8 8 8 8 8 7 7 7 6 6 6 6 6 6 6 6 6 6 6 6 6 6 6 6 6 6 6 6 1 1 1 1 1 1 1 1 1 1 1 1 1 1 1 1 1 1 1 1 1 1 1 1 1
symmnumber: 1
zpe: 1123831.0 jmol-1
zpe.correction: 0.428045 hartree
zpe.thermalcorrener: 0.458417 hartree
zpe.thermalcorrenthalpy: 0.459361 hartree
zpe.thermalcorrgfe: 0.360647 hartree
zpe.sumelectzpe: -1465.573672 hartree
zpe.sumelectthermal: -1465.543299 hartree
zpe.sumelectthermalent: -1465.542355 hartree
zpe.sumelectthermalfe: -1465.641070 hartree
dipole: -1.1223 -2.0469 0.0178
dipole: 2.3344
quadrupole: -136.5200 -252.5969 -174.7760
quadrupole: 45.7714 -0.1724 -0.1021
quadrupole: 51.4443 -64.6326 13.1883 45.7714 -0.1724 -0.1021
hfenergy: -1466.0017165 hartree
pointgroup: C01 [X(C20H25N3O7)]
dipole: -0.4042046 -0.8243232 0.0249333 debye
polarizability: 463.9578979|-112.8521677|523.7894207|13.7371841|-18.0028339|143.7624642 unknown
InChI: InChI=1S/C20H25N3O7/c1-3-4-5-6-7-8-11-28-20(25)17-12-16(19(30-17)22-14(2)24)21-13-15-9-10-18(29-15)23(26)27/h9-10,12-13,22H,3-8,11H2,1-2H3
charge 0 multiplicity 1
55 atoms
O  2.520065 -1.378236 -0.002912
O  -0.622694 -3.256725 -0.023742
O  2.214649 -3.7072 0.063495
O  -3.931879 3.009782 -0.363261
O  -2.312837 -5.604605 0.03012
O  -6.599307 5.397148 -0.532039
O  -4.315309 5.699002 -0.479331
N  -3.040067 -3.373959 -0.085354
N  -2.906957 -0.478453 -0.197124
N  -5.375389 4.958293 -0.480367
C  6.83804 1.131725 0.064059
C  8.382494 1.08801 0.091643
C  6.184315 -0.268265 0.067572
C  9.028397 2.491712 0.09143
C  4.639162 -0.19616 0.032465
C  10.573749 2.455648 0.116127
C  4.000578 -1.583816 0.042057
C  11.208823 3.862788 0.117502
C  1.745341 -2.547176 0.012813
C  0.32593 -2.175863 -0.039809
C  -0.337161 -0.962775 -0.10667
C  -1.757097 -1.249725 -0.134791
C  -1.862306 -2.663905 -0.081341
C  -2.870038 0.841566 -0.24809
C  -4.089842 1.604125 -0.312686
C  -3.253507 -4.779528 -0.031696
C  -5.460871 1.289371 -0.339219
C  -5.224652 3.534563 -0.420574
C  -6.181794 2.519323 -0.408202
C  -4.731899 -5.151033 -0.056239
H  6.503968 1.688977 -0.835968
H  6.472654 1.708021 0.939567
H  8.750025 0.515218 -0.785519
H  8.718984 0.529858 0.990448
H  6.551397 -0.846152 -0.805905
H  6.512751 -0.823509 0.970646
H  8.690789 3.051421 -0.806118
H  8.662825 3.064538 0.96951
H  4.271547 0.378458 0.904551
H  4.311041 0.347838 -0.874338
H  10.910454 1.895399 1.012444
H  10.938544 1.884334 -0.762009
H  4.246124 -2.155847 0.956128
H  4.295179 -2.190178 -0.834746
H  10.884297 4.443331 1.001803
H  12.312967 3.80963 0.135103
H  10.912242 4.432539 -0.783485
H  0.159697 0.003858 -0.131515
H  -3.854266 -2.746752 -0.134457
H  -1.936664 1.431595 -0.244819
H  -5.870083 0.282954 -0.311429
H  -7.257472 2.669254 -0.444685
H  -5.225409 -4.774662 -0.971379
H  -5.263546 -4.731399 0.81793
H  -4.819281 -6.246256 -0.030893
