program: Gaussian 09
title: 000148349
version: EM64L-G09RevD.01
frameworkgroup: C1[X(C20H12O)]
method: RPBEPBE
basis: SDD
operation: Freq
keyword: #pfreq=noraman
keyword: PBEPBE/SDD
title: #p freq=noraman PBEPBE/SDD
converged: YES YES NO NO
title: Mulliken charges:
elementType: O C C C C C C C C C C C C C C C C C C C C H H H H H H H H H H H H
charge: -0.225084 -0.309868 -0.198152 0.307597 0.075881 -0.249653 0.300234 0.428777 -0.274172 -0.462921 0.068616 -0.372306 -0.460965 -0.714932 0.643415 0.422577 -0.369113 -0.423639 -0.467597 -0.421780 -0.218745 0.253148 0.251383 0.244861 0.219779 0.258300 0.247688 0.232307 0.241870 0.252975 0.245356 0.250058 0.224102
chargesum: 0.00000
title: Mulliken charges with hydrogens summed into heavy atoms:
elementType: O C C C C C C C C C C C C C C C C C C C C
charge: -0.225084 -0.056719 0.053231 0.307597 0.075881 -0.004791 0.300234 0.428777 -0.054393 -0.204620 0.068616 -0.372306 -0.213277 -0.482626 0.643415 0.422577 -0.127242 -0.170664 -0.222241 -0.171722 0.005357
polarizability: 4.04970260e+02 1.49616784e+00 2.48003029e+02 -9.12245538e-01 4.44864623e-02 9.11194852e+01
1716.lowfreq: -5.4354 -0.0007 -0.0002 0.0006 2.9861 5.1890 54.5929 58.1472 120.8643
frequency: 54.5861 58.1429 120.8638 145.0708 168.9143 214.3600 248.5759 256.2840 282.2217 285.3035 330.4934 377.4312 390.8258 419.9393 457.2287 472.5559 481.3378 496.3263 512.9301 548.5926 562.6226 584.6938 608.0036 611.1573 643.9789 653.7321 681.6808 692.9378 720.9745 745.5256 764.9591 769.2069 790.8083 797.1655 818.6169 824.8820 841.1186 858.8909 861.5564 907.6199 916.5486 934.6871 939.6744 941.3686 975.9083 983.6727 984.1002 1016.2775 1020.9506 1026.5331 1047.6433 1078.6146 1093.7557 1103.3600 1139.1326 1181.4404 1186.4047 1207.5464 1229.5665 1232.9687 1258.4692 1295.2211 1305.0638 1323.9446 1328.4054 1340.5984 1354.2918 1369.6826 1383.4867 1389.2967 1412.5684 1430.1246 1454.5258 1476.2118 1480.7061 1505.9127 1530.7403 1565.1768 1595.7412 1624.3732 1627.1267 3033.4408 3045.9183 3124.7706 3135.6541 3136.4397 3138.9234 3152.5190 3157.1354 3162.6183 3165.2384 3176.4530 3203.4673
redmass: 6.0673 4.5633 4.8071 6.3956 4.5331 3.8911 5.1878 4.7936 6.0615 5.2372 3.4403 5.5868 3.4330 3.7177 4.1606 4.2388 5.9381 4.4715 3.7599 5.0751 3.4090 4.9890 4.3146 3.3100 5.8311 2.9922 5.7222 5.7506 2.5344 1.5185 2.1360 1.7558 5.7475 3.4808 4.0704 2.0319 4.6244 1.8587 4.4769 2.1895 1.3815 1.5583 1.4206 3.8505 1.3654 2.2240 1.3851 3.1092 2.4403 2.0639 2.9099 1.4178 1.2824 2.7792 1.3171 1.3759 1.3248 2.0027 1.5474 2.2462 2.3505 1.6276 2.2162 1.3888 2.1175 2.9561 2.1423 2.9758 2.7356 2.9100 2.4713 7.2825 3.7699 4.7103 6.0352 5.2483 5.5701 6.7833 7.5967 7.3566 7.6849 1.0844 1.0835 1.0862 1.0871 1.0923 1.0871 1.0927 1.0981 1.0978 1.0951 1.0886 1.1044
irintensity: 0.3199 0.2755 7.1007 0.3679 0.7798 6.8305 1.5591 0.8106 3.3960 0.7035 1.1289 0.4354 0.5994 5.1006 2.2346 3.1680 2.1376 1.0719 1.6030 14.1357 0.2543 8.5275 3.5182 0.3846 0.8286 3.7368 2.7613 2.2117 57.2675 35.9473 23.6930 1.6936 32.8623 27.3475 32.2518 39.5823 12.4993 30.5901 15.0985 30.6404 1.3778 0.1287 2.0717 1.4694 1.0586 25.2258 2.4784 8.4242 10.0680 4.9041 0.6519 0.0286 28.6781 0.5545 0.9146 26.5173 4.1754 5.3923 19.6183 4.1719 2.4516 0.7422 1.7149 2.1216 2.6866 1.0938 14.4328 25.7217 3.4717 48.0391 8.0204 18.0015 5.4566 5.3678 63.9044 0.6634 0.9313 18.3961 4.1552 8.6870 14.2559 4.3240 14.1149 0.2484 0.4343 14.0825 0.2346 2.0494 43.1146 14.6426 26.9579 1.1754 18.7145
temp: 298.150 k
press: 1.00000 atm
elementType: 8 6 6 6 6 6 6 6 6 6 6 6 6 6 6 6 6 6 6 6 6 1 1 1 1 1 1 1 1 1 1 1 1
symmnumber: 1
zpe: 657865.5 jmol-1
zpe.correction: 0.250568 hartree
zpe.thermalcorrener: 0.264952 hartree
zpe.thermalcorrenthalpy: 0.265896 hartree
zpe.thermalcorrgfe: 0.209692 hartree
zpe.sumelectzpe: -843.049201 hartree
zpe.sumelectthermal: -843.034817 hartree
zpe.sumelectthermalent: -843.033873 hartree
zpe.sumelectthermalfe: -843.090077 hartree
dipole: -3.0983 -1.5722 -0.2297
dipole: 3.4819
quadrupole: -128.2325 -102.2600 -125.7453
quadrupole: -3.3135 -1.7245 -0.3154
quadrupole: -9.4865 16.4859 -6.9994 -3.3135 -1.7245 -0.3154
hfenergy: -843.2997688 hartree
pointgroup: C01 [X(C20H12O1)]
dipole: -1.2263876 0.6030626 0.0943184 debye
polarizability: 404.9780455|0.3446257|247.969114|1.6164786|1.7937044|91.1456155 unknown
InChI: InChI=1S/C20H12O/c1-2-11-4-5-15-13-6-7-16-14(8-9-18-20(16)21-18)17(13)10-12(3-1)19(11)15/h1-10,18,20H
charge 0 multiplicity 1
33 atoms
O  5.500906 -0.323201 -0.222798
C  4.106573 -0.341678 0.389717
C  4.466186 0.754539 -0.552366
C  2.69594 -0.769656 0.120316
C  1.88409 0.415813 0.140735
C  3.865542 2.016621 -0.004709
C  0.429674 0.2668 0.096698
C  -0.130348 -1.100517 0.030353
C  2.523816 1.765923 0.245552
C  2.130389 -2.075315 0.080607
C  -1.545264 -1.244799 -0.02198
C  -2.351533 -0.084333 -0.011231
C  0.748507 -2.235385 0.018552
C  -0.443148 1.396787 0.092934
C  -1.856516 1.241424 0.04069
C  -3.742527 -0.440758 -0.071651
C  -2.474626 -2.395911 -0.092284
C  -3.782077 -1.918837 -0.120277
C  -2.850764 2.291065 0.033267
C  -4.680896 0.593719 -0.076172
C  -4.211026 1.961177 -0.022171
H  4.243474 -0.082472 1.453509
H  4.183002 0.584489 -1.604524
H  4.297476 3.022878 -0.001034
H  1.876685 2.615055 0.485892
H  2.798281 -2.942297 0.08753
H  0.311175 -3.237728 -0.033464
H  -0.030715 2.409861 0.116323
H  -2.182627 -3.447797 -0.116888
H  -4.687887 -2.526026 -0.170765
H  -2.541426 3.34218 0.071485
H  -5.75877 0.399487 -0.12088
H  -4.954666 2.766192 -0.026369
